BDBM50022269 (4-Hydroxy-5-oxo-10,11-dihydro-5H-dibenzo[a,d]cyclohepten-2-yl)-acetic acid::CHEMBL312290
SMILES: OC(=O)Cc1cc(O)c2c(CCc3ccccc3C2=O)c1
InChI Key: InChIKey=JVEFSZWISSUUPY-UHFFFAOYSA-N
Data: 1 IC50
Activity Spreadsheet -- Enzyme Inhibition Constant Data from BindingDB
Found 1 hit for monomerid = 50022269
Trg + Lig
Ki
nM
ΔG°
kcal/mole
IC50
nM
Kd
nM
EC50/IC50
nM
koff
s-1
kon
M-1s-1
pHTemp
°C
Aldose reductase (AR)
(Homo sapiens (Human))
BDBM50022269
((4-Hydroxy-5-oxo-10,11-dihydro-5H-dibenzo[a,d]cycl...)
Show SMILES OC(=O)Cc1cc(O)c2c(CCc3ccccc3C2=O)c1
Show InChI InChI=1S/C17H14O4/c18-14-8-10(9-15(19)20)7-12-6-5-11-3-1-2-4-13(11)17(21)16(12)14/h1-4,7-8,18H,5-6,9H2,(H,19,20)
n/an/a 1.10E+5n/an/an/an/an/an/a
TBA
Curated by ChEMBL
Assay Description
In vitro inhibition of rabbit lens aldose reductase.
J Med Chem 29: 2347-51 (1986)
BindingDB Entry DOI: 10.7270/Q23R0RWW