BDBM50022539 CHEMBL14982
SMILES: Cl.Oc1ccc(CC2=NCCN2)c(F)c1O
InChI Key: InChIKey=CXENFCOXZDPSEA-UHFFFAOYSA-N
Data: 1 IC50
Activity Spreadsheet -- Enzyme Inhibition Constant Data from BindingDB
Found 1 hit for monomerid = 50022539
Trg + Lig
Ki
nM
ΔG°
kcal/mole
IC50
nM
Kd
nM
EC50/IC50
nM
koff
s-1
kon
M-1s-1
pHTemp
°C
Serotonin (5-HT) receptor
(Homo sapiens (Human))
BDBM50022539
(CHEMBL14982)
Show SMILES Cl.Oc1ccc(CC2=NCCN2)c(F)c1O |t:6|
Show InChI InChI=1S/C12H13N3O/c13-14-12(16)9-10-4-3-5-11(8-10)15-6-1-2-7-15/h1-8H,9,13H2,(H,14,16)
n/an/a 6.46E+13n/an/an/an/an/an/a
Ohio State University
Curated by ChEMBL
Assay Description
Stimulatory activity against serotonin secretion (SEC).
J Med Chem 33: 1138-44 (1990)
BindingDB Entry DOI: 10.7270/Q2ZC853J