BDBM50022747 2-(3-Amino-2-hydroxy-4-phenyl-thiobutyrylamino)-4-methyl-pentanoic acid; TFA::CHEMBL304141::CHEMBL68979
SMILES: CC(C)C[C@H](NC(=S)[C@@H](O)[C@H](N)Cc1ccccc1)C(O)=O
InChI Key: InChIKey=RIXMIOPSNNGXFZ-RDBSUJKOSA-N
Data: 3 KI  1 IC50
Activity Spreadsheet -- Enzyme Inhibition Constant Data from BindingDB
Found 4 hits for monomerid = 50022747
Trg + Lig
Ki
nM
ΔG°
kcal/mole
IC50
nM
Kd
nM
EC50/IC50
nM
koff
s-1
kon
M-1s-1
pHTemp
°C
Leucine aminopeptidase
(Homo sapiens (Human))
BDBM50022747
(2-(3-Amino-2-hydroxy-4-phenyl-thiobutyrylamino)-4-...)
Show SMILES CC(C)C[C@H](NC(=S)[C@@H](O)[C@H](N)Cc1ccccc1)C(O)=O
Show InChI InChI=1S/C16H24N2O3S/c1-10(2)8-13(16(20)21)18-15(22)14(19)12(17)9-11-6-4-3-5-7-11/h3-7,10,12-14,19H,8-9,17H2,1-2H3,(H,18,22)(H,20,21)/t12-,13+,14+/m1/s1
330n/an/an/an/an/an/an/an/a
University of Wisconsin
Curated by ChEMBL
Assay Description
Inhibitory activity against Leucine aminopeptidase
J Med Chem 31: 2193-9 (1988)
BindingDB Entry DOI: 10.7270/Q2Z038RM
Aminopeptidase B
(Rattus norvegicus)
BDBM50022747
(2-(3-Amino-2-hydroxy-4-phenyl-thiobutyrylamino)-4-...)
Show SMILES CC(C)C[C@H](NC(=S)[C@@H](O)[C@H](N)Cc1ccccc1)C(O)=O
Show InChI InChI=1S/C16H24N2O3S/c1-10(2)8-13(16(20)21)18-15(22)14(19)12(17)9-11-6-4-3-5-7-11/h3-7,10,12-14,19H,8-9,17H2,1-2H3,(H,18,22)(H,20,21)/t12-,13+,14+/m1/s1
2.40E+3n/an/an/an/an/an/an/an/a
University of Wisconsin
Curated by ChEMBL
Assay Description
Inhibitory activity against aminopeptidase B
J Med Chem 31: 2193-9 (1988)
BindingDB Entry DOI: 10.7270/Q2Z038RM
Aminopeptidase N
(Sus scrofa (Pig))
BDBM50022747
(2-(3-Amino-2-hydroxy-4-phenyl-thiobutyrylamino)-4-...)
Show SMILES CC(C)C[C@H](NC(=S)[C@@H](O)[C@H](N)Cc1ccccc1)C(O)=O
Show InChI InChI=1S/C16H24N2O3S/c1-10(2)8-13(16(20)21)18-15(22)14(19)12(17)9-11-6-4-3-5-7-11/h3-7,10,12-14,19H,8-9,17H2,1-2H3,(H,18,22)(H,20,21)/t12-,13+,14+/m1/s1
4.03E+4n/an/an/an/an/an/an/an/a
University of Wisconsin
Curated by ChEMBL
Assay Description
Inhibitory activity against Aminopeptidase M
J Med Chem 31: 2193-9 (1988)
BindingDB Entry DOI: 10.7270/Q2Z038RM
Leukotriene A4 hydrolase
(Homo sapiens (Human))
BDBM50022747
(2-(3-Amino-2-hydroxy-4-phenyl-thiobutyrylamino)-4-...)
Show SMILES CC(C)C[C@H](NC(=S)[C@@H](O)[C@H](N)Cc1ccccc1)C(O)=O
Show InChI InChI=1S/C16H24N2O3S/c1-10(2)8-13(16(20)21)18-15(22)14(19)12(17)9-11-6-4-3-5-7-11/h3-7,10,12-14,19H,8-9,17H2,1-2H3,(H,18,22)(H,20,21)/t12-,13+,14+/m1/s1
Reactome pathway
n/an/a>1.00E+5n/an/an/an/an/an/a
Scripps Research Institute
Curated by ChEMBL
Assay Description
Inhibition of amidase activity of LTA4 hydrolase purified from human leukocytes
J Med Chem 36: 211-20 (1993)
BindingDB Entry DOI: 10.7270/Q2T152P3