BDBM50022859 CHEMBL407670::Pro-His-Pro-Phe-His-Leu[CH2NH]Val-Ile-His-Lys::Pro-His-Prp-Phe-His-Leu(psi)[CH2NH]Val-Ile-His-Lys::Pro-His-Prp-Phe-His-Leu(psi)[CH2NH]Val-Ile-His-Lys(H-142)
SMILES: CC[C@H](C)[C@H](NC(=O)[C@@H](NC[C@H](CC(C)C)NC(=O)[C@H](Cc1cnc[nH]1)NC(=O)[C@H](Cc1ccccc1)NC(=O)[C@@H]1CCCN1C(=O)[C@H](Cc1cnc[nH]1)NC(=O)[C@@H]1CCCN1)C(C)C)C(=O)N[C@@H](Cc1cnc[nH]1)C(=O)N[C@@H](CCCCN)C(O)=O
InChI Key: InChIKey=XIZSMQBWVQNHCA-NIRMQQKASA-N
Data: 3 IC50  1 Kd
Activity Spreadsheet -- Enzyme Inhibition Constant Data from BindingDB
Found 4 hits for monomerid = 50022859
Trg + Lig
Ki
nM
ΔG°
kcal/mole
IC50
nM
Kd
nM
EC50/IC50
nM
koff
s-1
kon
M-1s-1
pHTemp
°C
Renin
(Homo sapiens (Human))
BDBM50022859
(CHEMBL407670 | Pro-His-Pro-Phe-His-Leu[CH2NH]Val-I...)
Show SMILES CC[C@H](C)[C@H](NC(=O)[C@@H](NC[C@H](CC(C)C)NC(=O)[C@H](Cc1cnc[nH]1)NC(=O)[C@H](Cc1ccccc1)NC(=O)[C@@H]1CCCN1C(=O)[C@H](Cc1cnc[nH]1)NC(=O)[C@@H]1CCCN1)C(C)C)C(=O)N[C@@H](Cc1cnc[nH]1)C(=O)N[C@@H](CCCCN)C(O)=O
Show InChI InChI=1S/C60H91N17O10/c1-7-37(6)51(58(84)74-47(26-40-29-63-33-68-40)55(81)71-44(60(86)87)17-11-12-20-61)76-57(83)50(36(4)5)66-31-42(23-35(2)3)70-53(79)46(25-39-28-62-32-67-39)72-54(80)45(24-38-15-9-8-10-16-38)73-56(82)49-19-14-22-77(49)59(85)48(27-41-30-64-34-69-41)75-52(78)43-18-13-21-65-43/h8-10,15-16,28-30,32-37,42-51,65-66H,7,11-14,17-27,31,61H2,1-6H3,(H,62,67)(H,63,68)(H,64,69)(H,70,79)(H,71,81)(H,72,80)(H,73,82)(H,74,84)(H,75,78)(H,76,83)(H,86,87)/t37-,42-,43-,44-,45-,46-,47-,48-,49-,50-,51-/m0/s1
Reactome pathway
n/an/a 10n/an/an/an/an/an/a
Upjohn Company
Curated by ChEMBL
Assay Description
Inhibition of Human plasma renin
J Med Chem 31: 671-7 (1988)
BindingDB Entry DOI: 10.7270/Q2HT2NBN
Renin
(Homo sapiens (Human))
BDBM50022859
(CHEMBL407670 | Pro-His-Pro-Phe-His-Leu[CH2NH]Val-I...)
Show SMILES CC[C@H](C)[C@H](NC(=O)[C@@H](NC[C@H](CC(C)C)NC(=O)[C@H](Cc1cnc[nH]1)NC(=O)[C@H](Cc1ccccc1)NC(=O)[C@@H]1CCCN1C(=O)[C@H](Cc1cnc[nH]1)NC(=O)[C@@H]1CCCN1)C(C)C)C(=O)N[C@@H](Cc1cnc[nH]1)C(=O)N[C@@H](CCCCN)C(O)=O
Show InChI InChI=1S/C60H91N17O10/c1-7-37(6)51(58(84)74-47(26-40-29-63-33-68-40)55(81)71-44(60(86)87)17-11-12-20-61)76-57(83)50(36(4)5)66-31-42(23-35(2)3)70-53(79)46(25-39-28-62-32-67-39)72-54(80)45(24-38-15-9-8-10-16-38)73-56(82)49-19-14-22-77(49)59(85)48(27-41-30-64-34-69-41)75-52(78)43-18-13-21-65-43/h8-10,15-16,28-30,32-37,42-51,65-66H,7,11-14,17-27,31,61H2,1-6H3,(H,62,67)(H,63,68)(H,64,69)(H,70,79)(H,71,81)(H,72,80)(H,73,82)(H,74,84)(H,75,78)(H,76,83)(H,86,87)/t37-,42-,43-,44-,45-,46-,47-,48-,49-,50-,51-/m0/s1
Reactome pathway
n/an/an/a 8n/an/an/an/an/a
Upjohn Company
Curated by ChEMBL
Assay Description
Dissociation constant (Kd) of renin inhibitor was determined over a temperature range of 8-37 degree by the fluorescence displacement assay
J Med Chem 33: 2080-6 (1990)
BindingDB Entry DOI: 10.7270/Q2D50KX6
Renin
(Homo sapiens (Human))
BDBM50022859
(CHEMBL407670 | Pro-His-Pro-Phe-His-Leu[CH2NH]Val-I...)
Show SMILES CC[C@H](C)[C@H](NC(=O)[C@@H](NC[C@H](CC(C)C)NC(=O)[C@H](Cc1cnc[nH]1)NC(=O)[C@H](Cc1ccccc1)NC(=O)[C@@H]1CCCN1C(=O)[C@H](Cc1cnc[nH]1)NC(=O)[C@@H]1CCCN1)C(C)C)C(=O)N[C@@H](Cc1cnc[nH]1)C(=O)N[C@@H](CCCCN)C(O)=O
Show InChI InChI=1S/C60H91N17O10/c1-7-37(6)51(58(84)74-47(26-40-29-63-33-68-40)55(81)71-44(60(86)87)17-11-12-20-61)76-57(83)50(36(4)5)66-31-42(23-35(2)3)70-53(79)46(25-39-28-62-32-67-39)72-54(80)45(24-38-15-9-8-10-16-38)73-56(82)49-19-14-22-77(49)59(85)48(27-41-30-64-34-69-41)75-52(78)43-18-13-21-65-43/h8-10,15-16,28-30,32-37,42-51,65-66H,7,11-14,17-27,31,61H2,1-6H3,(H,62,67)(H,63,68)(H,64,69)(H,70,79)(H,71,81)(H,72,80)(H,73,82)(H,74,84)(H,75,78)(H,76,83)(H,86,87)/t37-,42-,43-,44-,45-,46-,47-,48-,49-,50-,51-/m0/s1
Reactome pathway
n/an/a 10n/an/an/an/an/an/a
Ciba-Geigy Limited
Curated by ChEMBL
Assay Description
In vitro inhibition of purified Human kidney renin (250 pg/mL) incubated with angiotensinogen at pH 7.2
J Med Chem 31: 1839-46 (1988)
BindingDB Entry DOI: 10.7270/Q2Z03744
Renin
(Homo sapiens (Human))
BDBM50022859
(CHEMBL407670 | Pro-His-Pro-Phe-His-Leu[CH2NH]Val-I...)
Show SMILES CC[C@H](C)[C@H](NC(=O)[C@@H](NC[C@H](CC(C)C)NC(=O)[C@H](Cc1cnc[nH]1)NC(=O)[C@H](Cc1ccccc1)NC(=O)[C@@H]1CCCN1C(=O)[C@H](Cc1cnc[nH]1)NC(=O)[C@@H]1CCCN1)C(C)C)C(=O)N[C@@H](Cc1cnc[nH]1)C(=O)N[C@@H](CCCCN)C(O)=O
Show InChI InChI=1S/C60H91N17O10/c1-7-37(6)51(58(84)74-47(26-40-29-63-33-68-40)55(81)71-44(60(86)87)17-11-12-20-61)76-57(83)50(36(4)5)66-31-42(23-35(2)3)70-53(79)46(25-39-28-62-32-67-39)72-54(80)45(24-38-15-9-8-10-16-38)73-56(82)49-19-14-22-77(49)59(85)48(27-41-30-64-34-69-41)75-52(78)43-18-13-21-65-43/h8-10,15-16,28-30,32-37,42-51,65-66H,7,11-14,17-27,31,61H2,1-6H3,(H,62,67)(H,63,68)(H,64,69)(H,70,79)(H,71,81)(H,72,80)(H,73,82)(H,74,84)(H,75,78)(H,76,83)(H,86,87)/t37-,42-,43-,44-,45-,46-,47-,48-,49-,50-,51-/m0/s1
Reactome pathway
n/an/a 10n/an/an/an/an/an/a
Upjohn Company
Curated by ChEMBL
Assay Description
In vitro inhibitory activity against human plasma renin
J Med Chem 31: 18-30 (1988)
BindingDB Entry DOI: 10.7270/Q2C53MDQ