BDBM50022935 CHEMBL3298372
SMILES: CN(C)CC[C@H](c1ccccc1)n1cc(NC(=O)c2n[nH]c3CC(C)(C)CCc23)cn1
InChI Key: InChIKey=XFYUTGIEFKGWND-OAQYLSRUSA-N
Data: 2 KI  1 IC50
Activity Spreadsheet -- Enzyme Inhibition Constant Data from BindingDB
Found 3 hits for monomerid = 50022935
Trg + Lig
Ki
nM
ΔG°
kcal/mole
IC50
nM
Kd
nM
EC50/IC50
nM
koff
s-1
kon
M-1s-1
pHTemp
°C
Tyrosine-protein kinase ITK/TSK
(Homo sapiens (Human))
BDBM50022935
(CHEMBL3298372)
Show SMILES CN(C)CC[C@H](c1ccccc1)n1cc(NC(=O)c2n[nH]c3CC(C)(C)CCc23)cn1 |r|
Show InChI InChI=1S/C24H32N6O/c1-24(2)12-10-19-20(14-24)27-28-22(19)23(31)26-18-15-25-30(16-18)21(11-13-29(3)4)17-8-6-5-7-9-17/h5-9,15-16,21H,10-14H2,1-4H3,(H,26,31)(H,27,28)/t21-/m1/s1
Reactome pathway
15n/an/an/an/an/an/an/an/a
Genentech Inc.
Curated by ChEMBL
Assay Description
Inhibition of GST-tagged full length ITK (unknown origin) using BLK peptide as substrate after 35 mins
J Med Chem 57: 5714-27 (2014)
Article DOI: 10.1021/jm500550e
BindingDB Entry DOI: 10.7270/Q2ZK5J7T
Aurora kinase A
(Homo sapiens (Human))
BDBM50022935
(CHEMBL3298372)
Show SMILES CN(C)CC[C@H](c1ccccc1)n1cc(NC(=O)c2n[nH]c3CC(C)(C)CCc23)cn1 |r|
Show InChI InChI=1S/C24H32N6O/c1-24(2)12-10-19-20(14-24)27-28-22(19)23(31)26-18-15-25-30(16-18)21(11-13-29(3)4)17-8-6-5-7-9-17/h5-9,15-16,21H,10-14H2,1-4H3,(H,26,31)(H,27,28)/t21-/m1/s1
NCI pathway
Reactome pathway
170n/an/an/an/an/an/an/an/a
Genentech Inc.
Curated by ChEMBL
Assay Description
Inhibition of human His-tagged full length AURKA using kemptide peptide as substrate after 60 mins
J Med Chem 57: 5714-27 (2014)
Article DOI: 10.1021/jm500550e
BindingDB Entry DOI: 10.7270/Q2ZK5J7T
Tyrosine-protein kinase ITK/TSK
(Homo sapiens (Human))
BDBM50022935
(CHEMBL3298372)
Show SMILES CN(C)CC[C@H](c1ccccc1)n1cc(NC(=O)c2n[nH]c3CC(C)(C)CCc23)cn1 |r|
Show InChI InChI=1S/C24H32N6O/c1-24(2)12-10-19-20(14-24)27-28-22(19)23(31)26-18-15-25-30(16-18)21(11-13-29(3)4)17-8-6-5-7-9-17/h5-9,15-16,21H,10-14H2,1-4H3,(H,26,31)(H,27,28)/t21-/m1/s1
Reactome pathway
n/an/a 520n/an/an/an/an/an/a
Genentech Inc.
Curated by ChEMBL
Assay Description
Inhibition of ITK in human Jurkat cells assessed as reduction in PLC-gamma phosphorylation after 30 mins
J Med Chem 57: 5714-27 (2014)
Article DOI: 10.1021/jm500550e
BindingDB Entry DOI: 10.7270/Q2ZK5J7T