BDBM50023163 CHEMBL3298863
SMILES: Cl.C[C@@H](NC1CC1)C(=O)c1cccc(Cl)c1
InChI Key: InChIKey=KAVKLTFECFTRLH-DDWIOCJRSA-N
Data: 1 IC50  1 EC50
Activity Spreadsheet -- Enzyme Inhibition Constant Data from BindingDB
Found 2 hits for monomerid = 50023163
Trg + Lig
Ki
nM
ΔG°
kcal/mole
IC50
nM
Kd
nM
EC50/IC50
nM
koff
s-1
kon
M-1s-1
pHTemp
°C
Sodium-dependent serotonin transporter
(Rattus norvegicus (rat))
BDBM50023163
(CHEMBL3298863)
Show SMILES Cl.C[C@@H](NC1CC1)C(=O)c1cccc(Cl)c1 |r|
Show InChI InChI=1S/C12H14ClNO.ClH/c1-8(14-11-5-6-11)12(15)9-3-2-4-10(13)7-9;/h2-4,7-8,11,14H,5-6H2,1H3;1H/t8-;/m1./s1
n/an/an/an/a 733n/an/an/an/a
RTI International
Curated by ChEMBL
Assay Description
Induction of SERT-mediated serotonin release in rat synaptosomes
ACS Med Chem Lett 5: 623-7 (2014)
Article DOI: 10.1021/ml500113s
BindingDB Entry DOI: 10.7270/Q2FN17SS
Sodium-dependent dopamine transporter
(Rattus norvegicus (rat))
BDBM50023163
(CHEMBL3298863)
Show SMILES Cl.C[C@@H](NC1CC1)C(=O)c1cccc(Cl)c1 |r|
Show InChI InChI=1S/C12H14ClNO.ClH/c1-8(14-11-5-6-11)12(15)9-3-2-4-10(13)7-9;/h2-4,7-8,11,14H,5-6H2,1H3;1H/t8-;/m1./s1
Reactome pathway
n/an/a 369n/an/an/an/an/an/a
RTI International
Curated by ChEMBL
Assay Description
Inhibition of DAT-mediated dopamine uptake in rat synaptosomes
ACS Med Chem Lett 5: 623-7 (2014)
Article DOI: 10.1021/ml500113s
BindingDB Entry DOI: 10.7270/Q2FN17SS