BDBM50023333 CHEMBL3334551
SMILES: OCCn1cc(cn1)-c1cnc2nnn(Cc3ccn4nccc4c3)c2n1
InChI Key: InChIKey=KJSAUKUYSFCYRX-UHFFFAOYSA-N
Data: 2 IC50
Activity Spreadsheet -- Enzyme Inhibition Constant Data from BindingDB
Found 2 hits for monomerid = 50023333
Trg + Lig
Ki
nM
ΔG°
kcal/mole
IC50
nM
Kd
nM
EC50/IC50
nM
koff
s-1
kon
M-1s-1
pHTemp
°C
Hepatocyte growth factor receptor
(Homo sapiens (Human))
BDBM50023333
(CHEMBL3334551)
Show SMILES OCCn1cc(cn1)-c1cnc2nnn(Cc3ccn4nccc4c3)c2n1
Show InChI InChI=1S/C17H15N9O/c27-6-5-24-11-13(8-20-24)15-9-18-16-17(21-15)26(23-22-16)10-12-2-4-25-14(7-12)1-3-19-25/h1-4,7-9,11,27H,5-6,10H2
n/an/a 7n/an/an/an/an/an/a
Hutchison MediPharma Limited
Curated by ChEMBL
Assay Description
Inhibition of c-Met autophosphorylation in human NCI-H441 cells for 1 hr by ELISA
J Med Chem 57: 7577-89 (2014)
Article DOI: 10.1021/jm500510f
BindingDB Entry DOI: 10.7270/Q2JD4ZCR
Hepatocyte growth factor receptor
(Homo sapiens (Human))
BDBM50023333
(CHEMBL3334551)
Show SMILES OCCn1cc(cn1)-c1cnc2nnn(Cc3ccn4nccc4c3)c2n1
Show InChI InChI=1S/C17H15N9O/c27-6-5-24-11-13(8-20-24)15-9-18-16-17(21-15)26(23-22-16)10-12-2-4-25-14(7-12)1-3-19-25/h1-4,7-9,11,27H,5-6,10H2
n/an/a 5n/an/an/an/an/an/a
Hutchison MediPharma Limited
Curated by ChEMBL
Assay Description
Inhibition of c-Met (unknown origin) using Poly E4Y substrate and ATP incubated for 45 mins by fluorescence polarization assay
J Med Chem 57: 7577-89 (2014)
Article DOI: 10.1021/jm500510f
BindingDB Entry DOI: 10.7270/Q2JD4ZCR