null
SMILES: CCCCCCCCc1ccc(OCC(=O)c2nccs2)cc1
InChI Key: InChIKey=UUVSXRBJOCNYHD-UHFFFAOYSA-N
Activity Spreadsheet -- Enzyme Inhibition Constant Data from BindingDB
Found 2 hits for monomerid = 50023444
Trg + Lig
Ki
nM
ΔG°
kcal/mole
IC50
nM
Kd
nM
EC50/IC50
nM
koff
s-1
kon
M-1s-1
pHTemp
°C
Cytosolic phospholipase A2
(Homo sapiens (Human))
BDBM50023444
(CHEMBL3329869 | US9597318, Code GK185)
Show SMILES CCCCCCCCc1ccc(OCC(=O)c2nccs2)cc1
Show InChI InChI=1S/C19H25NO2S/c1-2-3-4-5-6-7-8-16-9-11-17(12-10-16)22-15-18(21)19-20-13-14-23-19/h9-14H,2-8,15H2,1H3
US Patent
n/an/a 2.00E+3n/an/an/an/an/an/a
Avexxin AS
US Patent
Assay Description
Assay for cPLA2 activity was performed by the use of sonicated vesicles of 1-palmitoyl-2-arachidonoyl-sn-glycerol-3-phosphorylcholine (100 μM) c...
US Patent US9597318 (2017)
BindingDB Entry DOI: 10.7270/Q2HH6N4C
Cytosolic phospholipase A2
(Homo sapiens (Human))
BDBM50023444
(CHEMBL3329869 | US9597318, Code GK185)
Show SMILES CCCCCCCCc1ccc(OCC(=O)c2nccs2)cc1
Show InChI InChI=1S/C19H25NO2S/c1-2-3-4-5-6-7-8-16-9-11-17(12-10-16)22-15-18(21)19-20-13-14-23-19/h9-14H,2-8,15H2,1H3
n/an/a 1.20E+3n/an/an/an/an/an/a
University of Athens
Curated by ChEMBL
Assay Description
Inhibition of human recombinant GIVA cPLA2 in vitro vesicle assay
J Med Chem 57: 7523-35 (2014)
Article DOI: 10.1021/jm500192s
BindingDB Entry DOI: 10.7270/Q2HD7X7C