BDBM50023724 CHEMBL3341879
SMILES: Brc1ccc(NC(=O)Nc2cccc(c2)-c2cccc(n2)N2CCCC2)cc1
InChI Key: InChIKey=XQQZQIGGSBNCCX-UHFFFAOYSA-N
Data: 1 IC50
Activity Spreadsheet -- Enzyme Inhibition Constant Data from BindingDB
Found 1 hit for monomerid = 50023724
Trg + Lig
Ki
nM
ΔG°
kcal/mole
IC50
nM
Kd
nM
EC50/IC50
nM
koff
s-1
kon
M-1s-1
pHTemp
°C
Cannabinoid receptor 1
(Homo sapiens (Human))
BDBM50023724
(CHEMBL3341879)
Show SMILES Brc1ccc(NC(=O)Nc2cccc(c2)-c2cccc(n2)N2CCCC2)cc1
Show InChI InChI=1S/C22H21BrN4O/c23-17-9-11-18(12-10-17)24-22(28)25-19-6-3-5-16(15-19)20-7-4-8-21(26-20)27-13-1-2-14-27/h3-12,15H,1-2,13-14H2,(H2,24,25,28)
NCI pathway
Reactome pathway
n/an/a 98n/an/an/an/an/an/a
Research Triangle Institute
Curated by ChEMBL
Assay Description
Antagonist activity at human CB1 receptor stably expressed in RD-HGA16 cells assessed as inhibition of CP55,940-induced calcium mobilization after 15...
J Med Chem 57: 7758-69 (2014)
Article DOI: 10.1021/jm501042u
BindingDB Entry DOI: 10.7270/Q26W9CNX