BDBM50023747 CHEMBL3330341
SMILES: Cl.N[C@]1(C[C@@H]1c1ccccc1)c1ccccc1
InChI Key: InChIKey=YZRAPGMDGOUWPD-CTHHTMFSSA-N
Data: 3 IC50
Activity Spreadsheet -- Enzyme Inhibition Constant Data from BindingDB
Found 3 hits for monomerid = 50023747
Trg + Lig
Ki
nM
ΔG°
kcal/mole
IC50
nM
Kd
nM
EC50/IC50
nM
koff
s-1
kon
M-1s-1
pHTemp
°C
Amine oxidase (flavin-containing) A
(Homo sapiens (Human))
BDBM50023747
(CHEMBL3330341)
Show SMILES Cl.N[C@]1(C[C@@H]1c1ccccc1)c1ccccc1 |r|
Show InChI InChI=1S/C15H15N.ClH/c16-15(13-9-5-2-6-10-13)11-14(15)12-7-3-1-4-8-12;/h1-10,14H,11,16H2;1H/t14-,15-;/m1./s1
n/an/a 94n/an/an/an/an/an/a
European Institute of Oncology
Curated by ChEMBL
Assay Description
Inhibition of human recombinant MAOA expressed in Pichia pastoris incubated for 20 mins by bioluminescent-coupled assay
Eur J Med Chem 86: 352-63 (2014)
Article DOI: 10.1016/j.ejmech.2014.08.068
BindingDB Entry DOI: 10.7270/Q2ZG6TT3
Lysine-specific histone demethylase 1A
(Homo sapiens (Human))
BDBM50023747
(CHEMBL3330341)
Show SMILES Cl.N[C@]1(C[C@@H]1c1ccccc1)c1ccccc1 |r|
Show InChI InChI=1S/C15H15N.ClH/c16-15(13-9-5-2-6-10-13)11-14(15)12-7-3-1-4-8-12;/h1-10,14H,11,16H2;1H/t14-,15-;/m1./s1
Reactome pathway
n/an/a 131n/an/an/an/an/an/a
European Institute of Oncology
Curated by ChEMBL
Assay Description
Inhibition of human recombinant KDM1A/CoREST expressed in Escherichia coli assessed as reduction in H2O2 release using synthetic mono-methylated H3-K...
Eur J Med Chem 86: 352-63 (2014)
Article DOI: 10.1016/j.ejmech.2014.08.068
BindingDB Entry DOI: 10.7270/Q2ZG6TT3
Amine oxidase [flavin-containing] B
(Homo sapiens (Human))
BDBM50023747
(CHEMBL3330341)
Show SMILES Cl.N[C@]1(C[C@@H]1c1ccccc1)c1ccccc1 |r|
Show InChI InChI=1S/C15H15N.ClH/c16-15(13-9-5-2-6-10-13)11-14(15)12-7-3-1-4-8-12;/h1-10,14H,11,16H2;1H/t14-,15-;/m1./s1
n/an/a 1.15E+4n/an/an/an/an/an/a
European Institute of Oncology
Curated by ChEMBL
Assay Description
Inhibition of human recombinant MAOB expressed in Pichia pastoris incubated for 15 mins by bioluminescent-coupled assay
Eur J Med Chem 86: 352-63 (2014)
Article DOI: 10.1016/j.ejmech.2014.08.068
BindingDB Entry DOI: 10.7270/Q2ZG6TT3