BDBM50023867 INDIRUBIN::Indirubin
SMILES: Oc1[nH]c2ccccc2c1C1=Nc2ccccc2C1=O
InChI Key: InChIKey=JNLNPCNGMHKCKO-UHFFFAOYSA-N
Data: 5 IC50
Activity Spreadsheet -- Enzyme Inhibition Constant Data from BindingDB
Found 5 hits for monomerid = 50023867
Trg + Lig
Ki
nM
ΔG°
kcal/mole
IC50
nM
Kd
nM
EC50/IC50
nM
koff
s-1
kon
M-1s-1
pHTemp
°C
Cyclin-dependent kinase 1
(Homo sapiens (Human))
BDBM50023867
(INDIRUBIN | Indirubin)
Show SMILES Oc1[nH]c2ccccc2c1C1=Nc2ccccc2C1=O |t:12|
Show InChI InChI=1S/C16H10N2O2/c19-15-10-6-2-4-8-12(10)17-14(15)13-9-5-1-3-7-11(9)18-16(13)20/h1-8,18,20H
Reactome pathway
n/an/a 1.00E+4n/an/an/an/an/an/a
Guru Nanak Dev University
Curated by ChEMBL
Assay Description
Inhibition of CDK1
Eur J Med Chem 45: 4968-82 (2010)
Article DOI: 10.1016/j.ejmech.2010.08.004
BindingDB Entry DOI: 10.7270/Q2348KQD
Beta-chymotrypsin
(Homo sapiens (Human))
BDBM50023867
(INDIRUBIN | Indirubin)
Show SMILES Oc1[nH]c2ccccc2c1C1=Nc2ccccc2C1=O |t:12|
Show InChI InChI=1S/C16H10N2O2/c19-15-10-6-2-4-8-12(10)17-14(15)13-9-5-1-3-7-11(9)18-16(13)20/h1-8,18,20H
Reactome pathway
n/an/a 1.00E+5n/an/an/an/an/an/a
Northwestern University
Curated by ChEMBL
Assay Description
Inhibitory activity against Chymotrypsinogen from Thermus flavus
J Med Chem 46: 1478-83 (2003)
Article DOI: 10.1021/jm020427b
BindingDB Entry DOI: 10.7270/Q2R78FZT
Proto-oncogene tyrosine-protein kinase Src
(Homo sapiens (Human))
BDBM50023867
(INDIRUBIN | Indirubin)
Show SMILES Oc1[nH]c2ccccc2c1C1=Nc2ccccc2C1=O |t:12|
Show InChI InChI=1S/C16H10N2O2/c19-15-10-6-2-4-8-12(10)17-14(15)13-9-5-1-3-7-11(9)18-16(13)20/h1-8,18,20H
n/an/a 1.80E+4n/an/an/an/an/an/a
Northwestern University
Curated by ChEMBL
Assay Description
Inhibition of Src tyrosine kinase
J Med Chem 46: 1478-83 (2003)
Article DOI: 10.1021/jm020427b
BindingDB Entry DOI: 10.7270/Q2R78FZT
Cyclin-dependent kinase 2
(Homo sapiens (Human))
BDBM50023867
(INDIRUBIN | Indirubin)
Show SMILES Oc1[nH]c2ccccc2c1C1=Nc2ccccc2C1=O |t:12|
Show InChI InChI=1S/C16H10N2O2/c19-15-10-6-2-4-8-12(10)17-14(15)13-9-5-1-3-7-11(9)18-16(13)20/h1-8,18,20H
NCI pathway
Reactome pathway
n/an/a 2.20E+3n/an/an/an/an/an/a
Northwestern University
Curated by ChEMBL
Assay Description
Inhibition of Cyclin-dependent kinase 2 (CDK2)
J Med Chem 46: 1478-83 (2003)
Article DOI: 10.1021/jm020427b
BindingDB Entry DOI: 10.7270/Q2R78FZT
Malate dehydrogenase
(Thermus thermophilus)
BDBM50023867
(INDIRUBIN | Indirubin)
Show SMILES Oc1[nH]c2ccccc2c1C1=Nc2ccccc2C1=O |t:12|
Show InChI InChI=1S/C16H10N2O2/c19-15-10-6-2-4-8-12(10)17-14(15)13-9-5-1-3-7-11(9)18-16(13)20/h1-8,18,20H
n/an/a 3.00E+4n/an/an/an/an/an/a
Northwestern University
Curated by ChEMBL
Assay Description
Inhibitory activity against malate dehydrogenase (MDH) from Thermus flavus
J Med Chem 46: 1478-83 (2003)
Article DOI: 10.1021/jm020427b
BindingDB Entry DOI: 10.7270/Q2R78FZT