BDBM50023871 CHEMBL1207227
SMILES: Oc1[nH]c2ccc(cc2c1C1=Nc2ccccc2C1=O)S(O)(=O)=O
InChI Key: InChIKey=BYYOTMYLPPUWCF-UHFFFAOYSA-N
Data: 3 IC50
Activity Spreadsheet -- Enzyme Inhibition Constant Data from BindingDB
Found 3 hits for monomerid = 50023871
Trg + Lig
Ki
nM
ΔG°
kcal/mole
IC50
nM
Kd
nM
EC50/IC50
nM
koff
s-1
kon
M-1s-1
pHTemp
°C
Cyclin-dependent kinase 1
(Homo sapiens (Human))
BDBM50023871
(CHEMBL1207227)
Show SMILES Oc1[nH]c2ccc(cc2c1C1=Nc2ccccc2C1=O)S(O)(=O)=O |t:12|
Show InChI InChI=1S/C16H10N2O5S/c19-15-9-3-1-2-4-11(9)17-14(15)13-10-7-8(24(21,22)23)5-6-12(10)18-16(13)20/h1-7,18,20H,(H,21,22,23)
Reactome pathway
n/an/a 40n/an/an/an/an/an/a
Georgetown University
Curated by ChEMBL
Assay Description
Inhibition of CDK1
AAPS J 8: 204-21 (2006)
Article DOI: 10.1208/aapsj080125
BindingDB Entry DOI: 10.7270/Q2TX3GBS
Cyclin-dependent kinase 4
(Homo sapiens (Human))
BDBM50023871
(CHEMBL1207227)
Show SMILES Oc1[nH]c2ccc(cc2c1C1=Nc2ccccc2C1=O)S(O)(=O)=O |t:12|
Show InChI InChI=1S/C16H10N2O5S/c19-15-9-3-1-2-4-11(9)17-14(15)13-10-7-8(24(21,22)23)5-6-12(10)18-16(13)20/h1-7,18,20H,(H,21,22,23)
NCI pathway
Reactome pathway
n/an/a 200n/an/an/an/an/an/a
Georgetown University
Curated by ChEMBL
Assay Description
Inhibition of CDK4
AAPS J 8: 204-21 (2006)
Article DOI: 10.1208/aapsj080125
BindingDB Entry DOI: 10.7270/Q2TX3GBS
Cyclin-dependent kinase 2
(Homo sapiens (Human))
BDBM50023871
(CHEMBL1207227)
Show SMILES Oc1[nH]c2ccc(cc2c1C1=Nc2ccccc2C1=O)S(O)(=O)=O |t:12|
Show InChI InChI=1S/C16H10N2O5S/c19-15-9-3-1-2-4-11(9)17-14(15)13-10-7-8(24(21,22)23)5-6-12(10)18-16(13)20/h1-7,18,20H,(H,21,22,23)
NCI pathway
Reactome pathway
n/an/a 22n/an/an/an/an/an/a
Georgetown University
Curated by ChEMBL
Assay Description
Inhibition of CDK2
AAPS J 8: 204-21 (2006)
Article DOI: 10.1208/aapsj080125
BindingDB Entry DOI: 10.7270/Q2TX3GBS