null
SMILES: CC(C)C[C@@H](C(O)=O)C(=O)N[C@H](CS)Cc1ccccc1
InChI Key: InChIKey=IFDBSSIZDWPRKI-UONOGXRCSA-N
Activity Spreadsheet -- Enzyme Inhibition Constant Data from BindingDB
Found 1 hit for monomerid = 50024099
Trg + Lig
Ki
nM
ΔG°
kcal/mole
IC50
nM
Kd
nM
EC50/IC50
nM
koff
s-1
kon
M-1s-1
pHTemp
°C
Neprilysin
(Rattus norvegicus (Rat))
BDBM50024099
((R,S) 2-(1-Mercaptomethyl-2-phenyl-ethylcarbamoyl)...)
Show SMILES CC(C)C[C@@H](C(O)=O)C(=O)N[C@H](CS)Cc1ccccc1
Show InChI InChI=1S/C16H23NO3S/c1-11(2)8-14(16(19)20)15(18)17-13(10-21)9-12-6-4-3-5-7-12/h3-7,11,13-14,21H,8-10H2,1-2H3,(H,17,18)(H,19,20)/t13-,14+/m0/s1
Reactome pathway
n/an/a 1.5n/an/an/an/an/an/a
TBA
Curated by ChEMBL
Assay Description
Concentration for 50% inhibition of activity of rat kidney enkephalinase
J Med Chem 29: 751-7 (1986)
BindingDB Entry DOI: 10.7270/Q2HM57F3