BDBM50024124 1-Hydroxymethyl-5-(2-hydroxy-1-phenyl-ethylamino)-cyclohexane-1,2,3,4-tetraol::CHEMBL2374253
SMILES: [H][C@@](CO)(N[C@H]1C[C@](O)(CO)[C@@H](O)[C@H](O)[C@H]1O)c1ccccc1
InChI Key: InChIKey=IXFTUTFRGNVOPW-SOAFEQHCSA-N
Data: 2 IC50
Activity Spreadsheet -- Enzyme Inhibition Constant Data from BindingDB
Found 2 hits for monomerid = 50024124
Trg + Lig
Ki
nM
ΔG°
kcal/mole
IC50
nM
Kd
nM
EC50/IC50
nM
koff
s-1
kon
M-1s-1
pHTemp
°C
Maltase-glucoamylase
(Homo sapiens (Human))
BDBM50024124
(1-Hydroxymethyl-5-(2-hydroxy-1-phenyl-ethylamino)-...)
Show SMILES [H][C@@](CO)(N[C@H]1C[C@](O)(CO)[C@@H](O)[C@H](O)[C@H]1O)c1ccccc1
Show InChI InChI=1S/C15H23NO6/c17-7-11(9-4-2-1-3-5-9)16-10-6-15(22,8-18)14(21)13(20)12(10)19/h1-5,10-14,16-22H,6-8H2/t10-,11-,12-,13+,14-,15-/m0/s1
n/an/a 13n/an/an/an/an/an/a
TBA
Curated by ChEMBL
Assay Description
Inhibitory activity against porcine maltase
J Med Chem 29: 1038-46 (1986)
BindingDB Entry DOI: 10.7270/Q27P8ZZV
Sucrase-isomaltase
(Homo sapiens (Human))
BDBM50024124
(1-Hydroxymethyl-5-(2-hydroxy-1-phenyl-ethylamino)-...)
Show SMILES [H][C@@](CO)(N[C@H]1C[C@](O)(CO)[C@@H](O)[C@H](O)[C@H]1O)c1ccccc1
Show InChI InChI=1S/C15H23NO6/c17-7-11(9-4-2-1-3-5-9)16-10-6-15(22,8-18)14(21)13(20)12(10)19/h1-5,10-14,16-22H,6-8H2/t10-,11-,12-,13+,14-,15-/m0/s1
Reactome pathway
n/an/a 6.60n/an/an/an/an/an/a
TBA
Curated by ChEMBL
Assay Description
Alpha-D-glucosidase inhibitory activity and enzyme inhibition in vitro against porcine sucrase
J Med Chem 29: 1038-46 (1986)
BindingDB Entry DOI: 10.7270/Q27P8ZZV