BDBM50024254 CHEMBL125021
SMILES: CCOC(=O)c1ccc(cc1)-c1nn(Cc2ccccc2)c2ccccc12
InChI Key: InChIKey=LPROLPQTWKDPNU-UHFFFAOYSA-N
Data: 4 IC50
Activity Spreadsheet -- Enzyme Inhibition Constant Data from BindingDB
Found 4 hits for monomerid = 50024254
Trg + Lig
Ki
nM
ΔG°
kcal/mole
IC50
nM
Kd
nM
EC50/IC50
nM
koff
s-1
kon
M-1s-1
pHTemp
°C
Proteinase-activated receptor 1
(Homo sapiens (Human))
BDBM50024254
(CHEMBL125021)
Show SMILES CCOC(=O)c1ccc(cc1)-c1nn(Cc2ccccc2)c2ccccc12
Show InChI InChI=1S/C23H20N2O2/c1-2-27-23(26)19-14-12-18(13-15-19)22-20-10-6-7-11-21(20)25(24-22)16-17-8-4-3-5-9-17/h3-15H,2,16H2,1H3
n/an/a>1.00E+4n/an/an/an/an/an/a
Northwest Agriculture& Forestry University
Curated by ChEMBL
Assay Description
Antagonist activity at PAR1 in PAR-1-AP-stimulated human platelets compound pretreated for 5 mins by fluorescent PAC1 integrin alpha2bb3 activation a...
Bioorg Med Chem Lett 24: 4708-13 (2014)
Article DOI: 10.1016/j.bmcl.2014.08.021
BindingDB Entry DOI: 10.7270/Q29P336C
Proteinase-activated receptor 4 (PAR4)
(Homo sapiens (Human))
BDBM50024254
(CHEMBL125021)
Show SMILES CCOC(=O)c1ccc(cc1)-c1nn(Cc2ccccc2)c2ccccc12
Show InChI InChI=1S/C23H20N2O2/c1-2-27-23(26)19-14-12-18(13-15-19)22-20-10-6-7-11-21(20)25(24-22)16-17-8-4-3-5-9-17/h3-15H,2,16H2,1H3
n/an/a 130n/an/an/an/an/an/a
Northwest Agriculture & Forestry University
Curated by ChEMBL
Assay Description
Antagonist activity PAR4 (unknown origin)
J Med Chem 59: 7690-5 (2016)
Article DOI: 10.1021/acs.jmedchem.6b00928
Proteinase-activated receptor 1
(Homo sapiens (Human))
BDBM50024254
(CHEMBL125021)
Show SMILES CCOC(=O)c1ccc(cc1)-c1nn(Cc2ccccc2)c2ccccc12
Show InChI InChI=1S/C23H20N2O2/c1-2-27-23(26)19-14-12-18(13-15-19)22-20-10-6-7-11-21(20)25(24-22)16-17-8-4-3-5-9-17/h3-15H,2,16H2,1H3
n/an/a>1.00E+4n/an/an/an/an/an/a
Northwest Agriculture & Forestry University
Curated by ChEMBL
Assay Description
Inhibition of PAR1 (unknown origin)
J Med Chem 59: 7690-5 (2016)
Article DOI: 10.1021/acs.jmedchem.6b00928
Proteinase-activated receptor 4 (PAR4)
(Homo sapiens (Human))
BDBM50024254
(CHEMBL125021)
Show SMILES CCOC(=O)c1ccc(cc1)-c1nn(Cc2ccccc2)c2ccccc12
Show InChI InChI=1S/C23H20N2O2/c1-2-27-23(26)19-14-12-18(13-15-19)22-20-10-6-7-11-21(20)25(24-22)16-17-8-4-3-5-9-17/h3-15H,2,16H2,1H3
n/an/a 130n/an/an/an/an/an/a
Northwest Agriculture& Forestry University
Curated by ChEMBL
Assay Description
Antagonist activity at PAR4 in PAR-4-AP-stimulated human platelets compound pretreated for 5 mins by fluorescent PAC1 integrin alpha2bb3 activation a...
Bioorg Med Chem Lett 24: 4708-13 (2014)
Article DOI: 10.1016/j.bmcl.2014.08.021
BindingDB Entry DOI: 10.7270/Q29P336C