BDBM50024580 CHEMBL3330612
SMILES: Cn1c(=O)cnn(CCCCN2CCN(CC2)c2ccccn2)c1=O
InChI Key: InChIKey=ZXGRMQACDGUTBN-UHFFFAOYSA-N
Data: 1 KI  1 EC50
Activity Spreadsheet -- Enzyme Inhibition Constant Data from BindingDB
Found 2 hits for monomerid = 50024580
Trg + Lig
Ki
nM
ΔG°
kcal/mole
IC50
nM
Kd
nM
EC50/IC50
nM
koff
s-1
kon
M-1s-1
pHTemp
°C
5-hydroxytryptamine receptor 1A
(Homo sapiens (Human))
BDBM50024580
(CHEMBL3330612)
Show SMILES Cn1c(=O)cnn(CCCCN2CCN(CC2)c2ccccn2)c1=O
Show InChI InChI=1S/C17H24N6O2/c1-20-16(24)14-19-23(17(20)25)9-5-4-8-21-10-12-22(13-11-21)15-6-2-3-7-18-15/h2-3,6-7,14H,4-5,8-13H2,1H3
1.10n/an/an/an/an/an/an/an/a
Stony Brook University
Curated by ChEMBL
Assay Description
Displacement of [3H]8-OH-DPAT from 5HT1AR (unknown origin) by competition binding assay
Bioorg Med Chem Lett 24: 4759-62 (2014)
Article DOI: 10.1016/j.bmcl.2014.07.048
BindingDB Entry DOI: 10.7270/Q2NZ896M
5-hydroxytryptamine receptor 1A
(Homo sapiens (Human))
BDBM50024580
(CHEMBL3330612)
Show SMILES Cn1c(=O)cnn(CCCCN2CCN(CC2)c2ccccn2)c1=O
Show InChI InChI=1S/C17H24N6O2/c1-20-16(24)14-19-23(17(20)25)9-5-4-8-21-10-12-22(13-11-21)15-6-2-3-7-18-15/h2-3,6-7,14H,4-5,8-13H2,1H3
n/an/an/an/a 0.0800n/an/an/an/a
Stony Brook University
Curated by ChEMBL
Assay Description
Agonist activity at human 5HT1AR expressed in CHO cells assessed as increase in [35S]GTPgammaS binding by liquid scintillation spectrometry
Bioorg Med Chem Lett 24: 4759-62 (2014)
Article DOI: 10.1016/j.bmcl.2014.07.048
BindingDB Entry DOI: 10.7270/Q2NZ896M