null
SMILES: O=c1oc2cc(OCCCCN3CCN(Cc4ccccc4)CC3)ccc2c2ccccc12
InChI Key: InChIKey=TXSRJQSUOUJAIH-UHFFFAOYSA-N
Activity Spreadsheet -- Enzyme Inhibition Constant Data from BindingDB
Found 2 hits for monomerid = 50024868
Trg + Lig
Ki
nM
ΔG°
kcal/mole
IC50
nM
Kd
nM
EC50/IC50
nM
koff
s-1
kon
M-1s-1
pHTemp
°C
Acetylcholinesterase
(Homo sapiens (Human))
BDBM50024868
(CHEMBL3335071)
Show SMILES O=c1oc2cc(OCCCCN3CCN(Cc4ccccc4)CC3)ccc2c2ccccc12
Show InChI InChI=1S/C28H30N2O3/c31-28-26-11-5-4-10-24(26)25-13-12-23(20-27(25)33-28)32-19-7-6-14-29-15-17-30(18-16-29)21-22-8-2-1-3-9-22/h1-5,8-13,20H,6-7,14-19,21H2
NCI pathway
Reactome pathway
n/an/a 8.20E+3n/an/an/an/an/an/a
Eastern Mediterranean University
Curated by ChEMBL
Assay Description
Inhibition of human recombinant AChE using acetylthiocholine iodide substrate incubated for 15 mins by spectrophotometry based Ellman's method
Bioorg Med Chem 22: 5141-54 (2014)
Article DOI: 10.1016/j.bmc.2014.08.016
BindingDB Entry DOI: 10.7270/Q2WH2RKB
Cholinesterase
(Homo sapiens (Human))
BDBM50024868
(CHEMBL3335071)
Show SMILES O=c1oc2cc(OCCCCN3CCN(Cc4ccccc4)CC3)ccc2c2ccccc12
Show InChI InChI=1S/C28H30N2O3/c31-28-26-11-5-4-10-24(26)25-13-12-23(20-27(25)33-28)32-19-7-6-14-29-15-17-30(18-16-29)21-22-8-2-1-3-9-22/h1-5,8-13,20H,6-7,14-19,21H2
Reactome pathway
n/an/a>4.00E+4n/an/an/an/an/an/a
Eastern Mediterranean University
Curated by ChEMBL
Assay Description
Inhibition of human recombinant BuChE using butyrylthiocholine iodide substrate incubated for 15 mins by spectrophotometry based Ellman's method
Bioorg Med Chem 22: 5141-54 (2014)
Article DOI: 10.1016/j.bmc.2014.08.016
BindingDB Entry DOI: 10.7270/Q2WH2RKB