BDBM50024893 CHEMBL3335048
SMILES: O=c1oc2cc(OCCCN3CCN(Cc4ccccc4)CC3)ccc2c2CCCCc12
InChI Key: InChIKey=KMFIWXMOTHJQAP-UHFFFAOYSA-N
Data: 2 IC50
Activity Spreadsheet -- Enzyme Inhibition Constant Data from BindingDB
Found 2 hits for monomerid = 50024893
Trg + Lig
Ki
nM
ΔG°
kcal/mole
IC50
nM
Kd
nM
EC50/IC50
nM
koff
s-1
kon
M-1s-1
pHTemp
°C
Acetylcholinesterase
(Homo sapiens (Human))
BDBM50024893
(CHEMBL3335048)
Show SMILES O=c1oc2cc(OCCCN3CCN(Cc4ccccc4)CC3)ccc2c2CCCCc12
Show InChI InChI=1S/C27H32N2O3/c30-27-25-10-5-4-9-23(25)24-12-11-22(19-26(24)32-27)31-18-6-13-28-14-16-29(17-15-28)20-21-7-2-1-3-8-21/h1-3,7-8,11-12,19H,4-6,9-10,13-18,20H2
NCI pathway
Reactome pathway
n/an/a 900n/an/an/an/an/an/a
Eastern Mediterranean University
Curated by ChEMBL
Assay Description
Inhibition of human recombinant AChE using acetylthiocholine iodide substrate incubated for 15 mins by spectrophotometry based Ellman's method
Bioorg Med Chem 22: 5141-54 (2014)
Article DOI: 10.1016/j.bmc.2014.08.016
BindingDB Entry DOI: 10.7270/Q2WH2RKB
Cholinesterase
(Homo sapiens (Human))
BDBM50024893
(CHEMBL3335048)
Show SMILES O=c1oc2cc(OCCCN3CCN(Cc4ccccc4)CC3)ccc2c2CCCCc12
Show InChI InChI=1S/C27H32N2O3/c30-27-25-10-5-4-9-23(25)24-12-11-22(19-26(24)32-27)31-18-6-13-28-14-16-29(17-15-28)20-21-7-2-1-3-8-21/h1-3,7-8,11-12,19H,4-6,9-10,13-18,20H2
Reactome pathway
n/an/a 3.10E+3n/an/an/an/an/an/a
Eastern Mediterranean University
Curated by ChEMBL
Assay Description
Inhibition of human recombinant BuChE using butyrylthiocholine iodide substrate incubated for 15 mins by spectrophotometry based Ellman's method
Bioorg Med Chem 22: 5141-54 (2014)
Article DOI: 10.1016/j.bmc.2014.08.016
BindingDB Entry DOI: 10.7270/Q2WH2RKB