null
SMILES: Cl.CCN(C)C(=O)Oc1cc(cc2oc(=O)c3ccccc3c12)C(C)N(C)C
InChI Key: InChIKey=ZMXWTNRMUWBBRJ-UHFFFAOYSA-N
Activity Spreadsheet -- Enzyme Inhibition Constant Data from BindingDB
Found 2 hits for monomerid = 50024955
Trg + Lig
Ki
nM
ΔG°
kcal/mole
IC50
nM
Kd
nM
EC50/IC50
nM
koff
s-1
kon
M-1s-1
pHTemp
°C
Cholinesterase
(Homo sapiens (Human))
BDBM50024955
(CHEMBL3335023)
Show SMILES Cl.CCN(C)C(=O)Oc1cc(cc2oc(=O)c3ccccc3c12)C(C)N(C)C
Show InChI InChI=1S/C21H24N2O4.ClH/c1-6-23(5)21(25)27-18-12-14(13(2)22(3)4)11-17-19(18)15-9-7-8-10-16(15)20(24)26-17;/h7-13H,6H2,1-5H3;1H
Reactome pathway
n/an/a 1.27E+4n/an/an/an/an/an/a
Eastern Mediterranean University
Curated by ChEMBL
Assay Description
Inhibition of human recombinant BuChE using butyrylthiocholine iodide substrate incubated for 15 mins by spectrophotometry based Ellman's method
Bioorg Med Chem 22: 5141-54 (2014)
Article DOI: 10.1016/j.bmc.2014.08.016
BindingDB Entry DOI: 10.7270/Q2WH2RKB
Acetylcholinesterase
(Homo sapiens (Human))
BDBM50024955
(CHEMBL3335023)
Show SMILES Cl.CCN(C)C(=O)Oc1cc(cc2oc(=O)c3ccccc3c12)C(C)N(C)C
Show InChI InChI=1S/C21H24N2O4.ClH/c1-6-23(5)21(25)27-18-12-14(13(2)22(3)4)11-17-19(18)15-9-7-8-10-16(15)20(24)26-17;/h7-13H,6H2,1-5H3;1H
NCI pathway
Reactome pathway
n/an/a 3.97E+4n/an/an/an/an/an/a
Eastern Mediterranean University
Curated by ChEMBL
Assay Description
Inhibition of human recombinant AChE using acetylthiocholine iodide substrate incubated for 15 mins by spectrophotometry based Ellman's method
Bioorg Med Chem 22: 5141-54 (2014)
Article DOI: 10.1016/j.bmc.2014.08.016
BindingDB Entry DOI: 10.7270/Q2WH2RKB