null
SMILES: Nc1ncnc2n([C@@H]3O[C@H](COP(O)(=O)O[C@@H]4[C@H](O)[C@@H](COP(O)(=O)O[C@@H]5[C@H](O)[C@@H](COP(O)(O)=O)O[C@H]5n5c(Br)nc6c(N)ncnc56)O[C@H]4n4c(Br)nc5c(N)ncnc45)[C@@H](O)[C@H]3O)c(Br)nc12
InChI Key: InChIKey=VSGOVVWULIIUEN-UHFFFAOYSA-N
Activity Spreadsheet -- Enzyme Inhibition Constant Data from BindingDB
Found 1 hit for monomerid = 50025003
Trg + Lig
Ki
nM
ΔG°
kcal/mole
IC50
nM
Kd
nM
EC50/IC50
nM
koff
s-1
kon
M-1s-1
pHTemp
°C
2-5A-dependent ribonuclease
(Mus musculus)
BDBM50025003
((br8A)2'p5'(br8A)2'p5'(br8A) | CHEMBL3143413)
Show SMILES Nc1ncnc2n([C@@H]3O[C@H](COP(O)(=O)O[C@@H]4[C@H](O)[C@@H](COP(O)(=O)O[C@@H]5[C@H](O)[C@@H](COP(O)(O)=O)O[C@H]5n5c(Br)nc6c(N)ncnc56)O[C@H]4n4c(Br)nc5c(N)ncnc45)[C@@H](O)[C@H]3O)c(Br)nc12 |r|
Show InChI InChI=1S/C30H34Br3N15O13P2/c31-28-43-17-20(34)37-7-40-23(17)46(28)16-3-12(50)15(59-16)6-56-63(53,54)61-14-2-11(58-27(14)48-25-19(45-30(48)33)22(36)39-9-42-25)5-55-62(51,52)60-13-1-10(4-49)57-26(13)47-24-18(44-29(47)32)21(35)38-8-41-24/h7-16,26-27,49-50H,1-6H2,(H,51,52)(H,53,54)(H2,34,37,40)(H2,35,38,41)(H2,36,39,42)
n/an/a 1.00E+3n/an/an/an/an/an/a
TBA
Curated by ChEMBL
Assay Description
compound was tested for activation of RNase L by measuring concentration required for 50% inhibition of protein synthesis in mouse L cell extracts
J Med Chem 29: 1015-22 (1986)
BindingDB Entry DOI: 10.7270/Q2SX6C6K