BDBM50025183 CHEMBL3337891
SMILES: COc1cccc(CNC(=O)c2nc3scc(COCc4ccc(cc4)C#N)c3c(=O)[nH]2)c1
InChI Key: InChIKey=ZLNFRXBYCZFBMI-UHFFFAOYSA-N
Data: 1 IC50
Activity Spreadsheet -- Enzyme Inhibition Constant Data from BindingDB
Found 1 hit for monomerid = 50025183
Trg + Lig
Ki
nM
ΔG°
kcal/mole
IC50
nM
Kd
nM
EC50/IC50
nM
koff
s-1
kon
M-1s-1
pHTemp
°C
Collagenase 3
(Homo sapiens (Human))
BDBM50025183
(CHEMBL3337891)
Show SMILES COc1cccc(CNC(=O)c2nc3scc(COCc4ccc(cc4)C#N)c3c(=O)[nH]2)c1
Show InChI InChI=1S/C24H20N4O4S/c1-31-19-4-2-3-17(9-19)11-26-23(30)21-27-22(29)20-18(14-33-24(20)28-21)13-32-12-16-7-5-15(10-25)6-8-16/h2-9,14H,11-13H2,1H3,(H,26,30)(H,27,28,29)
NCI pathway
Reactome pathway
n/an/a 0.0180n/an/an/an/an/an/a
Takeda Pharmaceutical Company Ltd
Curated by ChEMBL
Assay Description
Inhibition of human recombinant MMP13 catalytic domain using fluorescence peptide Cy3-PLGLK(Cy5Q)AR-NH2 substrate by fluorescence assay
Bioorg Med Chem 22: 5487-505 (2014)
Article DOI: 10.1016/j.bmc.2014.07.025
BindingDB Entry DOI: 10.7270/Q27S7QBJ