BDBM50025213 CHEMBL3330648
SMILES: CCC(N)Cc1c[nH]c2ccc(F)cc12
InChI Key: InChIKey=QGUZSMSUGSSPNJ-UHFFFAOYSA-N
Data: 4 EC50
Activity Spreadsheet -- Enzyme Inhibition Constant Data from BindingDB
Found 4 hits for monomerid = 50025213
Trg + Lig
Ki
nM
ΔG°
kcal/mole
IC50
nM
Kd
nM
EC50/IC50
nM
koff
s-1
kon
M-1s-1
pHTemp
°C
Sodium-dependent dopamine transporter
(Rattus norvegicus (rat))
BDBM50025213
(CHEMBL3330648)
Show SMILES CCC(N)Cc1c[nH]c2ccc(F)cc12
Show InChI InChI=1S/C12H15FN2/c1-2-10(14)5-8-7-15-12-4-3-9(13)6-11(8)12/h3-4,6-7,10,15H,2,5,14H2,1H3
Reactome pathway
n/an/an/an/a 150n/an/an/an/a
Research Triangle Institute
Curated by ChEMBL
Assay Description
Induction of DAT-mediated dopamine release in rat brain synaptosomes by [3H]DA release assay
Bioorg Med Chem Lett 24: 4754-8 (2014)
Article DOI: 10.1016/j.bmcl.2014.07.062
BindingDB Entry DOI: 10.7270/Q2416ZNK
5-hydroxytryptamine receptor 2A
(Homo sapiens (Human))
BDBM50025213
(CHEMBL3330648)
Show SMILES CCC(N)Cc1c[nH]c2ccc(F)cc12
Show InChI InChI=1S/C12H15FN2/c1-2-10(14)5-8-7-15-12-4-3-9(13)6-11(8)12/h3-4,6-7,10,15H,2,5,14H2,1H3
Reactome pathway
n/an/an/an/a 246n/an/an/an/a
Research Triangle Institute
Curated by ChEMBL
Assay Description
Agonist activity at 5HT2A receptor (unknown origin) by cell based calcium mobilization assay
Bioorg Med Chem Lett 24: 4754-8 (2014)
Article DOI: 10.1016/j.bmcl.2014.07.062
BindingDB Entry DOI: 10.7270/Q2416ZNK
Norepinephrine Monoamine transporters
(Rattus norvegicus)
BDBM50025213
(CHEMBL3330648)
Show SMILES CCC(N)Cc1c[nH]c2ccc(F)cc12
Show InChI InChI=1S/C12H15FN2/c1-2-10(14)5-8-7-15-12-4-3-9(13)6-11(8)12/h3-4,6-7,10,15H,2,5,14H2,1H3
Reactome pathway
n/an/an/an/a 5.33E+3n/an/an/an/a
Research Triangle Institute
Curated by ChEMBL
Assay Description
Induction of NET-mediated norepinephrine release in rat brain synaptosomes by [3H]NE release assay
Bioorg Med Chem Lett 24: 4754-8 (2014)
Article DOI: 10.1016/j.bmcl.2014.07.062
BindingDB Entry DOI: 10.7270/Q2416ZNK
Sodium-dependent serotonin transporter
(Rattus norvegicus (rat))
BDBM50025213
(CHEMBL3330648)
Show SMILES CCC(N)Cc1c[nH]c2ccc(F)cc12
Show InChI InChI=1S/C12H15FN2/c1-2-10(14)5-8-7-15-12-4-3-9(13)6-11(8)12/h3-4,6-7,10,15H,2,5,14H2,1H3
n/an/an/an/a 37n/an/an/an/a
Research Triangle Institute
Curated by ChEMBL
Assay Description
Induction of 5-HTT-mediated 5-HT release in rat brain synaptosomes by [3H]5-HT release assay
Bioorg Med Chem Lett 24: 4754-8 (2014)
Article DOI: 10.1016/j.bmcl.2014.07.062
BindingDB Entry DOI: 10.7270/Q2416ZNK