null
SMILES: CCCCCCCCCCC1(CO1)C(=O)OC
InChI Key: InChIKey=UWRGACHEUZLLER-UHFFFAOYSA-N
Activity Spreadsheet -- Enzyme Inhibition Constant Data from BindingDB
Found 1 hit for monomerid = 50025257
Trg + Lig
Ki
nM
ΔG°
kcal/mole
IC50
nM
Kd
nM
EC50/IC50
nM
koff
s-1
kon
M-1s-1
pHTemp
°C
Carnitine palmitoyl transferase I liver isoform
(Sus scrofa)
BDBM50025257
(2-Decyl-oxirane-2-carboxylic acid methyl ester | C...)
Show SMILES CCCCCCCCCCC1(CO1)C(=O)OC
Show InChI InChI=1S/C14H26O3/c1-3-4-5-6-7-8-9-10-11-14(12-17-14)13(15)16-2/h3-12H2,1-2H3
n/an/a 680n/an/an/an/an/an/a
TBA
Curated by ChEMBL
Assay Description
Compound was tested for its inhibitory activity against carnitine palmitoyl transferase-A (CPT-A)
J Med Chem 29: 2184-90 (1986)
BindingDB Entry DOI: 10.7270/Q2R210CF