BDBM50025590 CHEMBL485475
SMILES: Oc1ccc(cc1)-c1c(CN2CCCCC2)oc2cc(O)cc(O)c2c1=O
InChI Key: InChIKey=SWNTYZWCZHKGOL-UHFFFAOYSA-N
Data: 1 IC50
Activity Spreadsheet -- Enzyme Inhibition Constant Data from BindingDB
Found 1 hit for monomerid = 50025590
Trg + Lig
Ki
nM
ΔG°
kcal/mole
IC50
nM
Kd
nM
EC50/IC50
nM
koff
s-1
kon
M-1s-1
pHTemp
°C
Epidermal growth factor receptor
(Homo sapiens (Human))
BDBM50025590
(CHEMBL485475)
Show SMILES Oc1ccc(cc1)-c1c(CN2CCCCC2)oc2cc(O)cc(O)c2c1=O
Show InChI InChI=1S/C21H21NO5/c23-14-6-4-13(5-7-14)19-18(12-22-8-2-1-3-9-22)27-17-11-15(24)10-16(25)20(17)21(19)26/h4-7,10-11,23-25H,1-3,8-9,12H2
n/an/a 1n/an/an/an/an/an/a
TBA
Curated by ChEMBL
Assay Description
Inhibition of EGFR
J Nat Prod 55: 1529-1560 (1992)
Article DOI: 10.1021/np50089a001
BindingDB Entry DOI: 10.7270/Q2J966CC