BDBM50025603 CHEBI:18215::SYRINGETIN::Syringetin
SMILES: COc1cc(cc(OC)c1O)-c1oc2cc(O)cc(O)c2c(=O)c1O
InChI Key: InChIKey=UZMAPBJVXOGOFT-UHFFFAOYSA-N
Data: 1 IC50
Activity Spreadsheet -- Enzyme Inhibition Constant Data from BindingDB
Found 1 hit for monomerid = 50025603
Trg + Lig
Ki
nM
ΔG°
kcal/mole
IC50
nM
Kd
nM
EC50/IC50
nM
koff
s-1
kon
M-1s-1
pHTemp
°C
Tyrosine-protein kinase Lck
(Homo sapiens (Human))
BDBM50025603
(CHEBI:18215 | SYRINGETIN | Syringetin)
Show SMILES COc1cc(cc(OC)c1O)-c1oc2cc(O)cc(O)c2c(=O)c1O
Show InChI InChI=1S/C17H14O8/c1-23-11-3-7(4-12(24-2)14(11)20)17-16(22)15(21)13-9(19)5-8(18)6-10(13)25-17/h3-6,18-20,22H,1-2H3
n/an/a 2n/an/an/an/an/an/a
TBA
Curated by ChEMBL
Assay Description
Inhibition of p56 lck
J Nat Prod 55: 1529-1560 (1992)
Article DOI: 10.1021/np50089a001
BindingDB Entry DOI: 10.7270/Q2J966CC