BDBM50025612 CHEMBL490773
SMILES: CC(C)OC(=O)c1oc2cc(O)cc(O)c2c(=O)c1-c1ccc(O)cc1
InChI Key: InChIKey=PPCXVMTVLKBCKY-UHFFFAOYSA-N
Data: 1 IC50
Activity Spreadsheet -- Enzyme Inhibition Constant Data from BindingDB
Found 1 hit for monomerid = 50025612
Trg + Lig
Ki
nM
ΔG°
kcal/mole
IC50
nM
Kd
nM
EC50/IC50
nM
koff
s-1
kon
M-1s-1
pHTemp
°C
Epidermal growth factor receptor
(Homo sapiens (Human))
BDBM50025612
(CHEMBL490773)
Show SMILES CC(C)OC(=O)c1oc2cc(O)cc(O)c2c(=O)c1-c1ccc(O)cc1
Show InChI InChI=1S/C19H16O7/c1-9(2)25-19(24)18-15(10-3-5-11(20)6-4-10)17(23)16-13(22)7-12(21)8-14(16)26-18/h3-9,20-22H,1-2H3
n/an/a 1n/an/an/an/an/an/a
TBA
Curated by ChEMBL
Assay Description
Inhibition of EGFR
J Nat Prod 55: 1529-1560 (1992)
Article DOI: 10.1021/np50089a001
BindingDB Entry DOI: 10.7270/Q2J966CC