BDBM50025751 CHEMBL3330866
SMILES: COC(=O)c1csc(Nc2ncc(Cl)c(Nc3ccccc3S(=O)(=O)C(C)C)n2)n1
InChI Key: InChIKey=JUMRJXVNKIHXKN-UHFFFAOYSA-N
Data: 1 IC50
Activity Spreadsheet -- Enzyme Inhibition Constant Data from BindingDB
Found 1 hit for monomerid = 50025751
Trg + Lig
Ki
nM
ΔG°
kcal/mole
IC50
nM
Kd
nM
EC50/IC50
nM
koff
s-1
kon
M-1s-1
pHTemp
°C
ALK tyrosine kinase receptor
(Homo sapiens (Human))
BDBM50025751
(CHEMBL3330866)
Show SMILES COC(=O)c1csc(Nc2ncc(Cl)c(Nc3ccccc3S(=O)(=O)C(C)C)n2)n1
Show InChI InChI=1S/C18H18ClN5O4S2/c1-10(2)30(26,27)14-7-5-4-6-12(14)21-15-11(19)8-20-17(23-15)24-18-22-13(9-29-18)16(25)28-3/h4-10H,1-3H3,(H2,20,21,22,23,24)
n/an/a>1.00E+3n/an/an/an/an/an/a
Shanghai Institute of Materia Medica (SIMM)
Curated by ChEMBL
Assay Description
Inhibition of purified ALK (unknown origin) after 60 mins by ELISA kinase assay
Eur J Med Chem 86: 438-48 (2014)
Article DOI: 10.1016/j.ejmech.2014.09.003
BindingDB Entry DOI: 10.7270/Q2G73GBS