BDBM50025923 2-Benzyl-3-(formyl-hydroxy-amino)-N-[(3-methyl-butylcarbamoyl)-methyl]-propionamide::CHEMBL16467
SMILES: CC(C)CCNC(=O)CNC(=O)C(CN(O)C=O)Cc1ccccc1
InChI Key: InChIKey=KSPQIBYPCZOIBJ-UHFFFAOYSA-N
Data: 1 IC50
Activity Spreadsheet -- Enzyme Inhibition Constant Data from BindingDB
Found 1 hit for monomerid = 50025923
Trg + Lig
Ki
nM
ΔG°
kcal/mole
IC50
nM
Kd
nM
EC50/IC50
nM
koff
s-1
kon
M-1s-1
pHTemp
°C
Neutral Endopeptidase (NEP)
(Rattus norvegicus (Rat))
BDBM50025923
(2-Benzyl-3-(formyl-hydroxy-amino)-N-[(3-methyl-but...)
Show SMILES CC(C)CCNC(=O)CNC(=O)C(CN(O)C=O)Cc1ccccc1
Show InChI InChI=1S/C18H27N3O4/c1-14(2)8-9-19-17(23)11-20-18(24)16(12-21(25)13-22)10-15-6-4-3-5-7-15/h3-7,13-14,16,25H,8-12H2,1-2H3,(H,19,23)(H,20,24)
Reactome pathway
n/an/a 800n/an/an/an/an/an/a
TBA
Curated by ChEMBL
Assay Description
In vitro inhibition of enkephalinase purified from rat kidney.
J Med Chem 28: 1158-69 (1985)
BindingDB Entry DOI: 10.7270/Q20C4WB5