BDBM50025940 4-[2-(2-Acetylamino-3-phenyl-propionylamino)-3-(1H-imidazol-4-yl)-propionylamino]-3-hydroxy-5-phenyl-pentanoic acid [1-(1-carbamoyl-2-phenyl-ethylcarbamoyl)-3-methyl-butyl]-amide::CHEMBL3144413::CHEMBL50983
SMILES: CC(C)C[C@H](NC(=O)C[C@H](O)[C@H](Cc1ccccc1)NC(=O)[C@H](Cc1c[nH]cn1)NC(=O)[C@H](Cc1ccccc1)NC(C)=O)C(=O)N[C@@H](Cc1ccccc1)C(N)=O
InChI Key: InChIKey=NKFOIGBFTVJTDL-UHFFFAOYSA-N
Data: 1 KI  2 IC50
Activity Spreadsheet -- Enzyme Inhibition Constant Data from BindingDB
Found 3 hits for monomerid = 50025940
Trg + Lig
Ki
nM
ΔG°
kcal/mole
IC50
nM
Kd
nM
EC50/IC50
nM
koff
s-1
kon
M-1s-1
pHTemp
°C
Renin
(Homo sapiens (Human))
BDBM50025940
(4-[2-(2-Acetylamino-3-phenyl-propionylamino)-3-(1H...)
Show SMILES CC(C)C[C@H](NC(=O)C[C@H](O)[C@H](Cc1ccccc1)NC(=O)[C@H](Cc1c[nH]cn1)NC(=O)[C@H](Cc1ccccc1)NC(C)=O)C(=O)N[C@@H](Cc1ccccc1)C(N)=O |r|
Show InChI InChI=1S/C43H54N8O7/c1-27(2)19-35(41(56)50-34(40(44)55)21-30-15-9-5-10-16-30)48-39(54)24-38(53)33(20-29-13-7-4-8-14-29)49-43(58)37(23-32-25-45-26-46-32)51-42(57)36(47-28(3)52)22-31-17-11-6-12-18-31/h4-18,25-27,33-38,53H,19-24H2,1-3H3,(H2,44,55)(H,45,46)(H,47,52)(H,48,54)(H,49,58)(H,50,56)(H,51,57)
Reactome pathway
210n/an/an/an/an/an/an/an/a
TBA
Curated by ChEMBL
Assay Description
Inhibition of human plasma renin
J Med Chem 28: 1779-90 (1986)
BindingDB Entry DOI: 10.7270/Q2FJ2HC2
Renin
(Homo sapiens (Human))
BDBM50025940
(4-[2-(2-Acetylamino-3-phenyl-propionylamino)-3-(1H...)
Show SMILES CC(C)C[C@H](NC(=O)C[C@H](O)[C@H](Cc1ccccc1)NC(=O)[C@H](Cc1c[nH]cn1)NC(=O)[C@H](Cc1ccccc1)NC(C)=O)C(=O)N[C@@H](Cc1ccccc1)C(N)=O |r|
Show InChI InChI=1S/C43H54N8O7/c1-27(2)19-35(41(56)50-34(40(44)55)21-30-15-9-5-10-16-30)48-39(54)24-38(53)33(20-29-13-7-4-8-14-29)49-43(58)37(23-32-25-45-26-46-32)51-42(57)36(47-28(3)52)22-31-17-11-6-12-18-31/h4-18,25-27,33-38,53H,19-24H2,1-3H3,(H2,44,55)(H,45,46)(H,47,52)(H,48,54)(H,49,58)(H,50,56)(H,51,57)
Reactome pathway
n/an/a 100n/an/an/an/an/an/a
TBA
Curated by ChEMBL
Assay Description
Inhibition of Renin
J Med Chem 28: 1779-90 (1986)
BindingDB Entry DOI: 10.7270/Q2FJ2HC2
Renin
(Homo sapiens (Human))
BDBM50025940
(4-[2-(2-Acetylamino-3-phenyl-propionylamino)-3-(1H...)
Show SMILES CC(C)C[C@H](NC(=O)C[C@H](O)[C@H](Cc1ccccc1)NC(=O)[C@H](Cc1c[nH]cn1)NC(=O)[C@H](Cc1ccccc1)NC(C)=O)C(=O)N[C@@H](Cc1ccccc1)C(N)=O |r|
Show InChI InChI=1S/C43H54N8O7/c1-27(2)19-35(41(56)50-34(40(44)55)21-30-15-9-5-10-16-30)48-39(54)24-38(53)33(20-29-13-7-4-8-14-29)49-43(58)37(23-32-25-45-26-46-32)51-42(57)36(47-28(3)52)22-31-17-11-6-12-18-31/h4-18,25-27,33-38,53H,19-24H2,1-3H3,(H2,44,55)(H,45,46)(H,47,52)(H,48,54)(H,49,58)(H,50,56)(H,51,57)
Reactome pathway
n/an/a 64n/an/an/an/an/an/a
TBA
Curated by ChEMBL
Assay Description
Inhibition of Renin
J Med Chem 28: 1779-90 (1986)
BindingDB Entry DOI: 10.7270/Q2FJ2HC2