BDBM50026039 CHEMBL3335244
SMILES: COc1cc(Br)c(Br)c(\C=N\c2ccc3[nH]c(=O)[nH]c3c2)c1O
InChI Key: InChIKey=IFGPRLKBEQJZAK-NGYBGAFCSA-N
Data: 6 IC50
Activity Spreadsheet -- Enzyme Inhibition Constant Data from BindingDB
Found 6 hits for monomerid = 50026039
Trg + Lig
Ki
nM
ΔG°
kcal/mole
IC50
nM
Kd
nM
EC50/IC50
nM
koff
s-1
kon
M-1s-1
pHTemp
°C
Tyrosine-protein kinase BRK
(Homo sapiens (Human))
BDBM50026039
(CHEMBL3335244)
Show SMILES COc1cc(Br)c(Br)c(\C=N\c2ccc3[nH]c(=O)[nH]c3c2)c1O
Show InChI InChI=1S/C15H11Br2N3O3/c1-23-12-5-9(16)13(17)8(14(12)21)6-18-7-2-3-10-11(4-7)20-15(22)19-10/h2-6,21H,1H3,(H2,19,20,22)/b18-6+
n/an/a 120n/an/an/an/an/an/a
Yonsei University
Curated by ChEMBL
Assay Description
Inhibition of GST-tagged PTK6 (unknown origin) assessed as phosphorylated tyrosines after 20 mins by ELISA
Bioorg Med Chem Lett 24: 4659-63 (2014)
Article DOI: 10.1016/j.bmcl.2014.08.036
BindingDB Entry DOI: 10.7270/Q2TH8P84
Tyrosine-protein kinase BRK
(Homo sapiens (Human))
BDBM50026039
(CHEMBL3335244)
Show SMILES COc1cc(Br)c(Br)c(\C=N\c2ccc3[nH]c(=O)[nH]c3c2)c1O
Show InChI InChI=1S/C15H11Br2N3O3/c1-23-12-5-9(16)13(17)8(14(12)21)6-18-7-2-3-10-11(4-7)20-15(22)19-10/h2-6,21H,1H3,(H2,19,20,22)/b18-6+
n/an/a 1.46E+3n/an/an/an/an/an/a
Yonsei University
Curated by ChEMBL
Assay Description
Inhibition of PTK6 (unknown origin) expressed in HEK293 cells assessed as decrease in tyrosine phosphorylation by chemiluminescence assay
Bioorg Med Chem Lett 24: 4659-63 (2014)
Article DOI: 10.1016/j.bmcl.2014.08.036
BindingDB Entry DOI: 10.7270/Q2TH8P84
Epidermal growth factor receptor
(Homo sapiens (Human))
BDBM50026039
(CHEMBL3335244)
Show SMILES COc1cc(Br)c(Br)c(\C=N\c2ccc3[nH]c(=O)[nH]c3c2)c1O
Show InChI InChI=1S/C15H11Br2N3O3/c1-23-12-5-9(16)13(17)8(14(12)21)6-18-7-2-3-10-11(4-7)20-15(22)19-10/h2-6,21H,1H3,(H2,19,20,22)/b18-6+
n/an/a 8.87E+4n/an/an/an/an/an/a
Yonsei University
Curated by ChEMBL
Assay Description
Inhibition of EGFR (unknown origin) expressed in HEK293 cells assessed as decrease in phosphorylation by chemiluminescence assay
Bioorg Med Chem Lett 24: 4659-63 (2014)
Article DOI: 10.1016/j.bmcl.2014.08.036
BindingDB Entry DOI: 10.7270/Q2TH8P84
Tyrosine-protein kinase Fyn
(Homo sapiens (Human))
BDBM50026039
(CHEMBL3335244)
Show SMILES COc1cc(Br)c(Br)c(\C=N\c2ccc3[nH]c(=O)[nH]c3c2)c1O
Show InChI InChI=1S/C15H11Br2N3O3/c1-23-12-5-9(16)13(17)8(14(12)21)6-18-7-2-3-10-11(4-7)20-15(22)19-10/h2-6,21H,1H3,(H2,19,20,22)/b18-6+
n/an/a 3.87E+4n/an/an/an/an/an/a
Yonsei University
Curated by ChEMBL
Assay Description
Inhibition of Fyn (unknown origin) expressed in HEK293 cells assessed as decrease in phosphorylation by chemiluminescence assay
Bioorg Med Chem Lett 24: 4659-63 (2014)
Article DOI: 10.1016/j.bmcl.2014.08.036
BindingDB Entry DOI: 10.7270/Q2TH8P84
Cytoplasmic tyrosine-protein kinase BMX
(Homo sapiens (Human))
BDBM50026039
(CHEMBL3335244)
Show SMILES COc1cc(Br)c(Br)c(\C=N\c2ccc3[nH]c(=O)[nH]c3c2)c1O
Show InChI InChI=1S/C15H11Br2N3O3/c1-23-12-5-9(16)13(17)8(14(12)21)6-18-7-2-3-10-11(4-7)20-15(22)19-10/h2-6,21H,1H3,(H2,19,20,22)/b18-6+
NCI pathway
Reactome pathway
n/an/a 3.86E+4n/an/an/an/an/an/a
Yonsei University
Curated by ChEMBL
Assay Description
Inhibition of Bmx (unknown origin) expressed in HEK293 cells assessed as decrease in phosphorylation by chemiluminescence assay
Bioorg Med Chem Lett 24: 4659-63 (2014)
Article DOI: 10.1016/j.bmcl.2014.08.036
BindingDB Entry DOI: 10.7270/Q2TH8P84
Proto-oncogene tyrosine-protein kinase Src
(Homo sapiens (Human))
BDBM50026039
(CHEMBL3335244)
Show SMILES COc1cc(Br)c(Br)c(\C=N\c2ccc3[nH]c(=O)[nH]c3c2)c1O
Show InChI InChI=1S/C15H11Br2N3O3/c1-23-12-5-9(16)13(17)8(14(12)21)6-18-7-2-3-10-11(4-7)20-15(22)19-10/h2-6,21H,1H3,(H2,19,20,22)/b18-6+
n/an/a>1.00E+5n/an/an/an/an/an/a
Yonsei University
Curated by ChEMBL
Assay Description
Inhibition of Src (unknown origin) expressed in HEK293 cells assessed as decrease in phosphorylation by chemiluminescence assay
Bioorg Med Chem Lett 24: 4659-63 (2014)
Article DOI: 10.1016/j.bmcl.2014.08.036
BindingDB Entry DOI: 10.7270/Q2TH8P84