BDBM50026205 CHEMBL1276194
SMILES: [H][C@]12CN(c3cc(F)c(c(F)c3)-c3ccnc4c(c(nn34)-c3ccncc3)-c3cccc4[nH]ncc34)[C@]([H])(CN1C(C)C)C2
InChI Key:
Data: 1 IC50
Activity Spreadsheet -- Enzyme Inhibition Constant Data from BindingDB
Found 1 hit for monomerid = 50026205
Trg + Lig
Ki
nM
ΔG°
kcal/mole
IC50
nM
Kd
nM
EC50/IC50
nM
koff
s-1
kon
M-1s-1
pHTemp
°C
Serine/threonine-protein kinase B-raf
(Homo sapiens (Human))
BDBM50026205
(CHEMBL1276194)
Show SMILES [H][C@]12CN(c3cc(F)c(c(F)c3)-c3ccnc4c(c(nn34)-c3ccncc3)-c3cccc4[nH]ncc34)[C@]([H])(CN1C(C)C)C2 |r,wU:36.42,1.0,(9.92,3.92,;8.84,2.82,;8.84,1.28,;7.51,.5,;7.52,-1.03,;6.18,-1.82,;6.19,-3.35,;4.86,-4.13,;7.52,-4.11,;8.86,-3.34,;10.2,-4.11,;8.85,-1.8,;7.53,-5.65,;6.2,-6.42,;6.2,-7.97,;7.54,-8.74,;8.87,-7.97,;10.35,-8.44,;11.26,-7.19,;10.34,-5.93,;8.87,-6.41,;12.79,-7.19,;13.56,-8.52,;15.1,-8.52,;15.88,-7.19,;15.1,-5.85,;13.56,-5.85,;10.82,-9.91,;12.32,-10.22,;12.8,-11.68,;11.77,-12.84,;10.26,-12.52,;9.02,-13.41,;7.78,-12.51,;8.26,-11.05,;9.79,-11.06,;6.17,1.26,;4.63,1.26,;6.16,2.8,;7.5,3.58,;7.49,5.12,;8.82,5.9,;6.15,5.89,;7.26,2.36,)|
NCI pathway
Reactome pathway
n/an/a<0.320n/an/an/an/an/an/a
Pfizer Inc.
Curated by ChEMBL
Assay Description
Inhibition of BRAF
J Med Chem 53: 7874-8 (2010)
Article DOI: 10.1021/jm1007566
BindingDB Entry DOI: 10.7270/Q2HM58Q3