BDBM50026251 CHEMBL3359005
SMILES: CN(CCOc1ccccc1C(C)(C)C)C(=O)Nc1ccccc1C(O)=O
InChI Key: InChIKey=IJPFFIAGVZVCKR-UHFFFAOYSA-N
Data: 2 IC50
Activity Spreadsheet -- Enzyme Inhibition Constant Data from BindingDB
Found 2 hits for monomerid = 50026251
Trg + Lig
Ki
nM
ΔG°
kcal/mole
IC50
nM
Kd
nM
EC50/IC50
nM
koff
s-1
kon
M-1s-1
pHTemp
°C
Retinol-binding protein 4
(Homo sapiens (Human))
BDBM50026251
(CHEMBL3359005)
Show SMILES CN(CCOc1ccccc1C(C)(C)C)C(=O)Nc1ccccc1C(O)=O
Show InChI InChI=1S/C21H26N2O4/c1-21(2,3)16-10-6-8-12-18(16)27-14-13-23(4)20(26)22-17-11-7-5-9-15(17)19(24)25/h5-12H,13-14H2,1-4H3,(H,22,26)(H,24,25)
Reactome pathway
n/an/a 65n/an/an/an/an/an/a
Albany Molecular Research
Curated by ChEMBL
Assay Description
Displacement of [3H]retinol from biotinylated human RBP4 by scintillation proximity assay
J Med Chem 57: 7731-57 (2014)
Article DOI: 10.1021/jm5010013
BindingDB Entry DOI: 10.7270/Q2FB54JT
Retinol-binding protein 4
(Homo sapiens (Human))
BDBM50026251
(CHEMBL3359005)
Show SMILES CN(CCOc1ccccc1C(C)(C)C)C(=O)Nc1ccccc1C(O)=O
Show InChI InChI=1S/C21H26N2O4/c1-21(2,3)16-10-6-8-12-18(16)27-14-13-23(4)20(26)22-17-11-7-5-9-15(17)19(24)25/h5-12H,13-14H2,1-4H3,(H,22,26)(H,24,25)
Reactome pathway
n/an/a 0.554n/an/an/an/an/an/a
Albany Molecular Research
Curated by ChEMBL
Assay Description
Antagonist activity at maltose binding protein-tagged RBP4 (unknown origin) expressed in Escherichia coli assessed as inhibition of retinol-induced p...
J Med Chem 57: 7731-57 (2014)
Article DOI: 10.1021/jm5010013
BindingDB Entry DOI: 10.7270/Q2FB54JT