BDBM50026328 CHEMBL1684207
SMILES: COCCNC(=O)c1ccc2OCC(Cc2c1)c1nc2ccc(cc2c(=O)[nH]1)-c1cn[nH]c1
InChI Key: InChIKey=UBJUSORRTPCGKC-UHFFFAOYSA-N
Data: 1 IC50
Activity Spreadsheet -- Enzyme Inhibition Constant Data from BindingDB
Found 1 hit for monomerid = 50026328
Trg + Lig
Ki
nM
ΔG°
kcal/mole
IC50
nM
Kd
nM
EC50/IC50
nM
koff
s-1
kon
M-1s-1
pHTemp
°C
Rho-associated protein kinase 2
(Homo sapiens (Human))
BDBM50026328
(CHEMBL1684207)
Show SMILES COCCNC(=O)c1ccc2OCC(Cc2c1)c1nc2ccc(cc2c(=O)[nH]1)-c1cn[nH]c1
Show InChI InChI=1S/C24H23N5O4/c1-32-7-6-25-23(30)15-3-5-21-16(8-15)9-17(13-33-21)22-28-20-4-2-14(18-11-26-27-12-18)10-19(20)24(31)29-22/h2-5,8,10-12,17H,6-7,9,13H2,1H3,(H,25,30)(H,26,27)(H,28,29,31)
n/an/a<1n/an/an/an/an/an/a
Translational Research Institute
Curated by ChEMBL
Assay Description
Inhibition of ROCK2 by HTRF assay
Bioorg Med Chem Lett 21: 1844-8 (2011)
Article DOI: 10.1016/j.bmcl.2011.01.039
BindingDB Entry DOI: 10.7270/Q20G3KFF