null
SMILES: [H][C@]1(COc2ccc(OC)cc2C1)c1nc2ccc(cc2c(=O)[nH]1)-c1cn[nH]c1
InChI Key: InChIKey=UQSIGODRTJNGKP-AWEZNQCLSA-N
Activity Spreadsheet -- Enzyme Inhibition Constant Data from BindingDB
Found 1 hit for monomerid = 50026346
Trg + Lig
Ki
nM
ΔG°
kcal/mole
IC50
nM
Kd
nM
EC50/IC50
nM
koff
s-1
kon
M-1s-1
pHTemp
°C
Rho-associated protein kinase 2
(Homo sapiens (Human))
BDBM50026346
(CHEMBL1684201)
Show SMILES [H][C@]1(COc2ccc(OC)cc2C1)c1nc2ccc(cc2c(=O)[nH]1)-c1cn[nH]c1 |r|
Show InChI InChI=1S/C21H16N4O3/c1-27-16-3-5-19-13(7-16)6-14(11-28-19)20-24-18-4-2-12(15-9-22-23-10-15)8-17(18)21(26)25-20/h2-5,7-10,14H,6,11H2,1H3/t14-/m0/s1
n/an/a<1n/an/an/an/an/an/a
Translational Research Institute
Curated by ChEMBL
Assay Description
Inhibition of ROCK2 by HTRF assay
Bioorg Med Chem Lett 21: 1844-8 (2011)
Article DOI: 10.1016/j.bmcl.2011.01.039
BindingDB Entry DOI: 10.7270/Q20G3KFF