BDBM50026352 CHEMBL3359034
SMILES: FC(F)(F)Oc1cccc(Cn2cnc3ccccc23)c1
InChI Key: InChIKey=IYKXFQBYXIOVSQ-UHFFFAOYSA-N
Data: 1 IC50
Activity Spreadsheet -- Enzyme Inhibition Constant Data from BindingDB
Found 1 hit for monomerid = 50026352
Trg + Lig
Ki
nM
ΔG°
kcal/mole
IC50
nM
Kd
nM
EC50/IC50
nM
koff
s-1
kon
M-1s-1
pHTemp
°C
1-deoxy-D-xylulose-5-phosphate synthase
(Deinococcus radiodurans (strain ATCC 13939 / DSM 2...)
BDBM50026352
(CHEMBL3359034)
Show SMILES FC(F)(F)Oc1cccc(Cn2cnc3ccccc23)c1
Show InChI InChI=1S/C15H11F3N2O/c16-15(17,18)21-12-5-3-4-11(8-12)9-20-10-19-13-6-1-2-7-14(13)20/h1-8,10H,9H2
n/an/a 5.95E+5n/an/an/an/an/an/a
University of Groningen
Curated by ChEMBL
Assay Description
Inhibition of Deinococcus radiodurans DXS
J Med Chem 57: 9740-63 (2014)
Article DOI: 10.1021/jm5010978
BindingDB Entry DOI: 10.7270/Q29K4CVJ