null
SMILES: CC(C)N1CCN(CC(=O)Nc2cc(Oc3ccc4n(C)c(Nc5cc(ccc5F)C(F)(F)F)nc4c3)ccn2)CC1
InChI Key: InChIKey=ZKNOTFQILSPCMY-UHFFFAOYSA-N
Activity Spreadsheet -- Enzyme Inhibition Constant Data from BindingDB
Found 2 hits for monomerid = 50026674
Trg + Lig
Ki
nM
ΔG°
kcal/mole
IC50
nM
Kd
nM
EC50/IC50
nM
koff
s-1
kon
M-1s-1
pHTemp
°C
Serine/threonine-protein kinase B-raf
(Homo sapiens (Human))
BDBM50026674
(CHEMBL3335386)
Show SMILES CC(C)N1CCN(CC(=O)Nc2cc(Oc3ccc4n(C)c(Nc5cc(ccc5F)C(F)(F)F)nc4c3)ccn2)CC1
Show InChI InChI=1S/C29H31F4N7O2/c1-18(2)40-12-10-39(11-13-40)17-27(41)37-26-16-21(8-9-34-26)42-20-5-7-25-24(15-20)36-28(38(25)3)35-23-14-19(29(31,32)33)4-6-22(23)30/h4-9,14-16,18H,10-13,17H2,1-3H3,(H,35,36)(H,34,37,41)
NCI pathway
Reactome pathway
n/an/a 6n/an/an/an/an/an/a
Novartis Institutes for Biomedical Research
Curated by ChEMBL
Assay Description
Inhibition of BRAF V600E mutant (unknown origin)
ACS Med Chem Lett 5: 989-92 (2014)
Article DOI: 10.1021/ml5002272
BindingDB Entry DOI: 10.7270/Q2RN39FP
Serine/threonine-protein kinase B-raf
(Homo sapiens (Human))
BDBM50026674
(CHEMBL3335386)
Show SMILES CC(C)N1CCN(CC(=O)Nc2cc(Oc3ccc4n(C)c(Nc5cc(ccc5F)C(F)(F)F)nc4c3)ccn2)CC1
Show InChI InChI=1S/C29H31F4N7O2/c1-18(2)40-12-10-39(11-13-40)17-27(41)37-26-16-21(8-9-34-26)42-20-5-7-25-24(15-20)36-28(38(25)3)35-23-14-19(29(31,32)33)4-6-22(23)30/h4-9,14-16,18H,10-13,17H2,1-3H3,(H,35,36)(H,34,37,41)
NCI pathway
Reactome pathway
n/an/an/an/a 100n/an/an/an/a
Novartis Institutes for Biomedical Research
Curated by ChEMBL
Assay Description
Inhibition of BRAF (unknown origin)-mediated ERK phosphorylation by cell-based assay
ACS Med Chem Lett 5: 989-92 (2014)
Article DOI: 10.1021/ml5002272
BindingDB Entry DOI: 10.7270/Q2RN39FP