BDBM50026831 CHEMBL1957082
SMILES: COc1ccc(cc1)-c1ocnc1C(=O)NCc1ccccc1
InChI Key: InChIKey=QOTSIOYFHJUVAY-UHFFFAOYSA-N
Data: 1 IC50
Activity Spreadsheet -- Enzyme Inhibition Constant Data from BindingDB
Found 1 hit for monomerid = 50026831
Trg + Lig
Ki
nM
ΔG°
kcal/mole
IC50
nM
Kd
nM
EC50/IC50
nM
koff
s-1
kon
M-1s-1
pHTemp
°C
Glycogen synthase kinase-3 beta
(Homo sapiens (Human))
BDBM50026831
(CHEMBL1957082)
Show SMILES COc1ccc(cc1)-c1ocnc1C(=O)NCc1ccccc1
Show InChI InChI=1S/C18H16N2O3/c1-22-15-9-7-14(8-10-15)17-16(20-12-23-17)18(21)19-11-13-5-3-2-4-6-13/h2-10,12H,11H2,1H3,(H,19,21)
NCI pathway
Reactome pathway
n/an/a 1.00E+3n/an/an/an/an/an/a
GlaxoSmithKline
Curated by ChEMBL
Assay Description
Inhibition of GSK3-beta by fluorescence polarization assay
Bioorg Med Chem Lett 22: 1989-94 (2012)
Article DOI: 10.1016/j.bmcl.2012.01.034
BindingDB Entry DOI: 10.7270/Q2ZP46KT