BDBM50026832 CHEMBL1957225
SMILES: COc1ccc(cc1Cl)-c1ocnc1C(=O)NCc1ccnc(C)c1
InChI Key: InChIKey=FYPBWYRJVFZUDM-UHFFFAOYSA-N
Data: 3 IC50
Activity Spreadsheet -- Enzyme Inhibition Constant Data from BindingDB
Found 3 hits for monomerid = 50026832
Trg + Lig
Ki
nM
ΔG°
kcal/mole
IC50
nM
Kd
nM
EC50/IC50
nM
koff
s-1
kon
M-1s-1
pHTemp
°C
Cyclin-dependent kinase 2
(Homo sapiens (Human))
BDBM50026832
(CHEMBL1957225)
Show SMILES COc1ccc(cc1Cl)-c1ocnc1C(=O)NCc1ccnc(C)c1
Show InChI InChI=1S/C18H16ClN3O3/c1-11-7-12(5-6-20-11)9-21-18(23)16-17(25-10-22-16)13-3-4-15(24-2)14(19)8-13/h3-8,10H,9H2,1-2H3,(H,21,23)
NCI pathway
Reactome pathway
n/an/a 1.26E+3n/an/an/an/an/an/a
GlaxoSmithKline
Curated by ChEMBL
Assay Description
Inhibition of CDK2 by AlphaLISA assay
Bioorg Med Chem Lett 22: 1989-94 (2012)
Article DOI: 10.1016/j.bmcl.2012.01.034
BindingDB Entry DOI: 10.7270/Q2ZP46KT
Glycogen synthase kinase-3 beta
(Homo sapiens (Human))
BDBM50026832
(CHEMBL1957225)
Show SMILES COc1ccc(cc1Cl)-c1ocnc1C(=O)NCc1ccnc(C)c1
Show InChI InChI=1S/C18H16ClN3O3/c1-11-7-12(5-6-20-11)9-21-18(23)16-17(25-10-22-16)13-3-4-15(24-2)14(19)8-13/h3-8,10H,9H2,1-2H3,(H,21,23)
NCI pathway
Reactome pathway
n/an/a 2.51E+3n/an/an/an/an/an/a
GlaxoSmithKline
Curated by ChEMBL
Assay Description
Inhibition of GSK3beta-mediated CRMP-2 phosphorylation by cell based assay
Bioorg Med Chem Lett 22: 1989-94 (2012)
Article DOI: 10.1016/j.bmcl.2012.01.034
BindingDB Entry DOI: 10.7270/Q2ZP46KT
Glycogen synthase kinase-3 beta
(Homo sapiens (Human))
BDBM50026832
(CHEMBL1957225)
Show SMILES COc1ccc(cc1Cl)-c1ocnc1C(=O)NCc1ccnc(C)c1
Show InChI InChI=1S/C18H16ClN3O3/c1-11-7-12(5-6-20-11)9-21-18(23)16-17(25-10-22-16)13-3-4-15(24-2)14(19)8-13/h3-8,10H,9H2,1-2H3,(H,21,23)
NCI pathway
Reactome pathway
n/an/a 32n/an/an/an/an/an/a
GlaxoSmithKline
Curated by ChEMBL
Assay Description
Inhibition of catalytic activity of GSK3-beta by AlphaLISA assay
Bioorg Med Chem Lett 22: 1989-94 (2012)
Article DOI: 10.1016/j.bmcl.2012.01.034
BindingDB Entry DOI: 10.7270/Q2ZP46KT