BDBM50026850 CHEMBL1957092
SMILES: COc1ccc(cc1F)-c1ocnc1C(=O)NCc1ccncc1
InChI Key: InChIKey=KFLLCGLJRIFHBA-UHFFFAOYSA-N
Data: 3 IC50
Activity Spreadsheet -- Enzyme Inhibition Constant Data from BindingDB
Found 3 hits for monomerid = 50026850
Trg + Lig
Ki
nM
ΔG°
kcal/mole
IC50
nM
Kd
nM
EC50/IC50
nM
koff
s-1
kon
M-1s-1
pHTemp
°C
Cyclin-dependent kinase 2
(Homo sapiens (Human))
BDBM50026850
(CHEMBL1957092)
Show SMILES COc1ccc(cc1F)-c1ocnc1C(=O)NCc1ccncc1
Show InChI InChI=1S/C17H14FN3O3/c1-23-14-3-2-12(8-13(14)18)16-15(21-10-24-16)17(22)20-9-11-4-6-19-7-5-11/h2-8,10H,9H2,1H3,(H,20,22)
NCI pathway
Reactome pathway
n/an/a 501n/an/an/an/an/an/a
GlaxoSmithKline
Curated by ChEMBL
Assay Description
Inhibition of CDK2 by AlphaLISA assay
Bioorg Med Chem Lett 22: 1989-94 (2012)
Article DOI: 10.1016/j.bmcl.2012.01.034
BindingDB Entry DOI: 10.7270/Q2ZP46KT
Glycogen synthase kinase-3 beta
(Homo sapiens (Human))
BDBM50026850
(CHEMBL1957092)
Show SMILES COc1ccc(cc1F)-c1ocnc1C(=O)NCc1ccncc1
Show InChI InChI=1S/C17H14FN3O3/c1-23-14-3-2-12(8-13(14)18)16-15(21-10-24-16)17(22)20-9-11-4-6-19-7-5-11/h2-8,10H,9H2,1H3,(H,20,22)
NCI pathway
Reactome pathway
n/an/a 1.00E+3n/an/an/an/an/an/a
GlaxoSmithKline
Curated by ChEMBL
Assay Description
Inhibition of GSK3beta-mediated CRMP-2 phosphorylation by cell based assay
Bioorg Med Chem Lett 22: 1989-94 (2012)
Article DOI: 10.1016/j.bmcl.2012.01.034
BindingDB Entry DOI: 10.7270/Q2ZP46KT
Glycogen synthase kinase-3 beta
(Homo sapiens (Human))
BDBM50026850
(CHEMBL1957092)
Show SMILES COc1ccc(cc1F)-c1ocnc1C(=O)NCc1ccncc1
Show InChI InChI=1S/C17H14FN3O3/c1-23-14-3-2-12(8-13(14)18)16-15(21-10-24-16)17(22)20-9-11-4-6-19-7-5-11/h2-8,10H,9H2,1H3,(H,20,22)
NCI pathway
Reactome pathway
n/an/a 32n/an/an/an/an/an/a
GlaxoSmithKline
Curated by ChEMBL
Assay Description
Inhibition of catalytic activity of GSK3-beta by AlphaLISA assay
Bioorg Med Chem Lett 22: 1989-94 (2012)
Article DOI: 10.1016/j.bmcl.2012.01.034
BindingDB Entry DOI: 10.7270/Q2ZP46KT