BDBM50026852 1-Isopropylamino-3-(7-methyl-indan-4-yloxy)-propan-2-ol::CHEMBL26917
SMILES: CC(C)NCC(O)COc1ccc(C)c2CCCc12
InChI Key: InChIKey=JLECPPBHIADANW-UHFFFAOYSA-N
Data: 1 KI  2 IC50
Activity Spreadsheet -- Enzyme Inhibition Constant Data from BindingDB
Found 3 hits for monomerid = 50026852
Trg + Lig
Ki
nM
ΔG°
kcal/mole
IC50
nM
Kd
nM
EC50/IC50
nM
koff
s-1
kon
M-1s-1
pHTemp
°C
5-hydroxytryptamine receptor 1A
(Rattus norvegicus (rat))
BDBM50026852
(1-Isopropylamino-3-(7-methyl-indan-4-yloxy)-propan...)
Show SMILES CC(C)NCC(O)COc1ccc(C)c2CCCc12
Show InChI InChI=1S/C16H25NO2/c1-11(2)17-9-13(18)10-19-16-8-7-12(3)14-5-4-6-15(14)16/h7-8,11,13,17-18H,4-6,9-10H2,1-3H3
1.91E+4n/an/an/an/an/an/an/an/a
Universit£ de Lausanne
Curated by ChEMBL
Assay Description
Binding affinity of a compound to rat brain 5-hydroxytryptamine 1A (serotonin) receptor assayed by radiolabeled [3H]-8-OH-DPAT ligand displacement
J Med Chem 39: 126-34 (1996)
Article DOI: 10.1021/jm950410b
BindingDB Entry DOI: 10.7270/Q2VX0K7V
Beta-1 adrenergic receptor
(Homo sapiens (Human))
BDBM50026852
(1-Isopropylamino-3-(7-methyl-indan-4-yloxy)-propan...)
Show SMILES CC(C)NCC(O)COc1ccc(C)c2CCCc12
Show InChI InChI=1S/C16H25NO2/c1-11(2)17-9-13(18)10-19-16-8-7-12(3)14-5-4-6-15(14)16/h7-8,11,13,17-18H,4-6,9-10H2,1-3H3
Reactome pathway
n/an/a 186n/an/an/an/an/an/a
TBA
Curated by ChEMBL
Assay Description
Compound was tested for inhibition of [3H]dihydroalprenolol radioligand binding to Beta-1 adrenergic receptor in dog heart.
J Med Chem 25: 931-6 (1982)
BindingDB Entry DOI: 10.7270/Q2ZP46P5
ADRB2
(BOVINE)
BDBM50026852
(1-Isopropylamino-3-(7-methyl-indan-4-yloxy)-propan...)
Show SMILES CC(C)NCC(O)COc1ccc(C)c2CCCc12
Show InChI InChI=1S/C16H25NO2/c1-11(2)17-9-13(18)10-19-16-8-7-12(3)14-5-4-6-15(14)16/h7-8,11,13,17-18H,4-6,9-10H2,1-3H3
Reactome pathway
n/an/a 18n/an/an/an/an/an/a
TBA
Curated by ChEMBL
Assay Description
Compound was tested for inhibition of [3H]dihydroalprenolol radioligand binding to Beta-2 adrenergic receptor in calf lung membranes.
J Med Chem 25: 931-6 (1982)
BindingDB Entry DOI: 10.7270/Q2ZP46P5