null
SMILES: [H][C@@]1([C@H](O)[C@H](C)C\C=C\C)N(C)C(=O)[C@H](C(C)C)N(C)C(=O)[C@H](CC(C)C)N(C)C(=O)[C@H](CC(C)C)N(C)C(=O)[C@@H](C)NC(=O)[C@H](C)NC(=O)[C@@H](CC(C)C)N(C)C(=O)[C@H](CC(C)C)NC(=O)[C@@H](CC(C)C)N(C)C(=O)CN(C)C(=O)[C@H](CCC)NC1=O
InChI Key: InChIKey=SBCFFJUDXVVUOV-WVXREOFKSA-N
Activity Spreadsheet -- Enzyme Inhibition Constant Data from BindingDB
Found 1 hit for monomerid = 50026910
Trg + Lig
Ki
nM
ΔG°
kcal/mole
IC50
nM
Kd
nM
EC50/IC50
nM
koff
s-1
kon
M-1s-1
pHTemp
°C
fMet-Leu-Phe receptor
(Homo sapiens (Human))
BDBM50026910
(CHEMBL2372462)
Show SMILES [H][C@@]1([C@H](O)[C@H](C)C\C=C\C)N(C)C(=O)[C@H](C(C)C)N(C)C(=O)[C@H](CC(C)C)N(C)C(=O)[C@H](CC(C)C)N(C)C(=O)[C@@H](C)NC(=O)[C@H](C)NC(=O)[C@@H](CC(C)C)N(C)C(=O)[C@H](CC(C)C)NC(=O)[C@@H](CC(C)C)N(C)C(=O)CN(C)C(=O)[C@H](CCC)NC1=O |r|
Show InChI InChI=1S/C64H115N11O12/c1-25-27-29-42(15)54(77)53-58(81)67-45(28-26-2)60(83)69(18)35-51(76)70(19)47(31-37(5)6)57(80)68-46(30-36(3)4)61(84)71(20)48(32-38(7)8)56(79)65-43(16)55(78)66-44(17)59(82)72(21)49(33-39(9)10)62(85)73(22)50(34-40(11)12)63(86)74(23)52(41(13)14)64(87)75(53)24/h25,27,36-50,52-54,77H,26,28-35H2,1-24H3,(H,65,79)(H,66,78)(H,67,81)(H,68,80)/b27-25+/t42-,43+,44-,45+,46+,47-,48-,49+,50+,52+,53+,54-/m1/s1
Reactome pathway
n/an/a>1.00E+4n/an/an/an/an/an/a
Strasbourg 1 University
Curated by ChEMBL
Assay Description
Inhibitory activity against human formylpeptide receptor (FPR) of human leukemia HL-60 cells
J Med Chem 45: 4613-28 (2002)
BindingDB Entry DOI: 10.7270/Q2571CQX