BDBM50026927 CHEMBL2372478
SMILES: [H][C@@]1([C@H](O)[C@H](C)C\C=C\C)N(C)C(=O)[C@H](C(C)C)N(C)C(=O)[C@H](CC(C)C)NC(=O)[C@H](CC(C)C)N(C)C(=O)[C@@H](C)NC(=O)[C@H](C)NC(=O)[C@H](CC(C)C)NC(=O)[C@H](NC(=O)[C@@H](CC(C)C)N(C)C(=O)CN(C)C(=O)[C@H](CC)NC1=O)C(C)C
InChI Key: InChIKey=KSXLKLPAJGKXSH-ZSZPNOAPSA-N
Data: 1 IC50
Activity Spreadsheet -- Enzyme Inhibition Constant Data from BindingDB
Found 1 hit for monomerid = 50026927
Trg + Lig
Ki
nM
ΔG°
kcal/mole
IC50
nM
Kd
nM
EC50/IC50
nM
koff
s-1
kon
M-1s-1
pHTemp
°C
fMet-Leu-Phe receptor
(Homo sapiens (Human))
BDBM50026927
(CHEMBL2372478)
Show SMILES [H][C@@]1([C@H](O)[C@H](C)C\C=C\C)N(C)C(=O)[C@H](C(C)C)N(C)C(=O)[C@H](CC(C)C)NC(=O)[C@H](CC(C)C)N(C)C(=O)[C@@H](C)NC(=O)[C@H](C)NC(=O)[C@H](CC(C)C)NC(=O)[C@H](NC(=O)[C@@H](CC(C)C)N(C)C(=O)CN(C)C(=O)[C@H](CC)NC1=O)C(C)C |r|
Show InChI InChI=1S/C60H107N11O12/c1-23-25-26-38(15)50(73)49-56(79)63-41(24-2)58(81)67(18)31-46(72)68(19)44(29-34(7)8)54(77)66-47(36(11)12)55(78)64-42(27-32(3)4)52(75)61-39(16)51(74)62-40(17)57(80)69(20)45(30-35(9)10)53(76)65-43(28-33(5)6)59(82)70(21)48(37(13)14)60(83)71(49)22/h23,25,32-45,47-50,73H,24,26-31H2,1-22H3,(H,61,75)(H,62,74)(H,63,79)(H,64,78)(H,65,76)(H,66,77)/b25-23+/t38-,39+,40-,41+,42+,43+,44-,45+,47-,48+,49+,50-/m1/s1
Reactome pathway
n/an/a 1.80E+3n/an/an/an/an/an/a
Strasbourg 1 University
Curated by ChEMBL
Assay Description
Inhibitory activity against human formylpeptide receptor (FPR) of human leukemia HL-60 cells
J Med Chem 45: 4613-28 (2002)
BindingDB Entry DOI: 10.7270/Q2571CQX