BDBM50026948 (trans) [3-(3,4-Dichloro-phenyl)-bicyclo[2.2.2]oct-2-ylmethyl]-dimethyl-amine(LR 5182)::CHEMBL173861
SMILES: CN(C)C[C@H]1C2CCC(CC2)[C@H]1c1ccc(Cl)c(Cl)c1
InChI Key: InChIKey=JOQQHMGSIKNGAF-NXDIHJKXSA-N
Data: 3 KI  2 IC50
Activity Spreadsheet -- Enzyme Inhibition Constant Data from BindingDB
Found 5 hits for monomerid = 50026948
Trg + Lig
Ki
nM
ΔG°
kcal/mole
IC50
nM
Kd
nM
EC50/IC50
nM
koff
s-1
kon
M-1s-1
pHTemp
°C
Sodium-dependent dopamine transporter
(Homo sapiens (Human))
BDBM50026948
((trans) [3-(3,4-Dichloro-phenyl)-bicyclo[2.2.2]oct...)
Show SMILES CN(C)C[C@H]1C2CCC(CC2)[C@H]1c1ccc(Cl)c(Cl)c1 |wD:11.13,4.3,(7.55,1.59,;6.22,.82,;4.89,1.59,;6.22,-.68,;4.89,-1.49,;3.54,-.72,;2.22,-1.49,;2.22,-3.03,;3.54,-3.8,;4.09,-2.55,;2.77,-2.03,;4.89,-3.03,;6.2,-3.8,;6.2,-5.34,;7.55,-6.11,;8.89,-5.34,;10.21,-6.11,;8.87,-3.8,;10.2,-2.99,;7.54,-3.03,)|
Show InChI InChI=1S/C17H23Cl2N/c1-20(2)10-14-11-3-5-12(6-4-11)17(14)13-7-8-15(18)16(19)9-13/h7-9,11-12,14,17H,3-6,10H2,1-2H3/t11?,12?,14-,17-/m0/s1
NCI pathway
Reactome pathway
7.20n/an/an/an/an/an/an/an/a
The University of Sydney
Curated by ChEMBL
Assay Description
Inhibition of DAT
Bioorg Med Chem Lett 21: 38-41 (2010)
Article DOI: 10.1016/j.bmcl.2010.11.075
BindingDB Entry DOI: 10.7270/Q20K28VR
Sodium-dependent noradrenaline transporter
(Homo sapiens (Human))
BDBM50026948
((trans) [3-(3,4-Dichloro-phenyl)-bicyclo[2.2.2]oct...)
Show SMILES CN(C)C[C@H]1C2CCC(CC2)[C@H]1c1ccc(Cl)c(Cl)c1 |wD:11.13,4.3,(7.55,1.59,;6.22,.82,;4.89,1.59,;6.22,-.68,;4.89,-1.49,;3.54,-.72,;2.22,-1.49,;2.22,-3.03,;3.54,-3.8,;4.09,-2.55,;2.77,-2.03,;4.89,-3.03,;6.2,-3.8,;6.2,-5.34,;7.55,-6.11,;8.89,-5.34,;10.21,-6.11,;8.87,-3.8,;10.2,-2.99,;7.54,-3.03,)|
Show InChI InChI=1S/C17H23Cl2N/c1-20(2)10-14-11-3-5-12(6-4-11)17(14)13-7-8-15(18)16(19)9-13/h7-9,11-12,14,17H,3-6,10H2,1-2H3/t11?,12?,14-,17-/m0/s1
Reactome pathway
44n/an/an/an/an/an/an/an/a
The University of Sydney
Curated by ChEMBL
Assay Description
Inhibition of NET
Bioorg Med Chem Lett 21: 38-41 (2010)
Article DOI: 10.1016/j.bmcl.2010.11.075
BindingDB Entry DOI: 10.7270/Q20K28VR
Sodium-dependent serotonin transporter
(Homo sapiens (Human))
BDBM50026948
((trans) [3-(3,4-Dichloro-phenyl)-bicyclo[2.2.2]oct...)
Show SMILES CN(C)C[C@H]1C2CCC(CC2)[C@H]1c1ccc(Cl)c(Cl)c1 |wD:11.13,4.3,(7.55,1.59,;6.22,.82,;4.89,1.59,;6.22,-.68,;4.89,-1.49,;3.54,-.72,;2.22,-1.49,;2.22,-3.03,;3.54,-3.8,;4.09,-2.55,;2.77,-2.03,;4.89,-3.03,;6.2,-3.8,;6.2,-5.34,;7.55,-6.11,;8.89,-5.34,;10.21,-6.11,;8.87,-3.8,;10.2,-2.99,;7.54,-3.03,)|
Show InChI InChI=1S/C17H23Cl2N/c1-20(2)10-14-11-3-5-12(6-4-11)17(14)13-7-8-15(18)16(19)9-13/h7-9,11-12,14,17H,3-6,10H2,1-2H3/t11?,12?,14-,17-/m0/s1
57n/an/an/an/an/an/an/an/a
The University of Sydney
Curated by ChEMBL
Assay Description
Inhibition of SERT
Bioorg Med Chem Lett 21: 38-41 (2010)
Article DOI: 10.1016/j.bmcl.2010.11.075
BindingDB Entry DOI: 10.7270/Q20K28VR
Sodium-dependent serotonin transporter
(Rattus norvegicus (rat))
BDBM50026948
((trans) [3-(3,4-Dichloro-phenyl)-bicyclo[2.2.2]oct...)
Show SMILES CN(C)C[C@H]1C2CCC(CC2)[C@H]1c1ccc(Cl)c(Cl)c1 |wD:11.13,4.3,(7.55,1.59,;6.22,.82,;4.89,1.59,;6.22,-.68,;4.89,-1.49,;3.54,-.72,;2.22,-1.49,;2.22,-3.03,;3.54,-3.8,;4.09,-2.55,;2.77,-2.03,;4.89,-3.03,;6.2,-3.8,;6.2,-5.34,;7.55,-6.11,;8.89,-5.34,;10.21,-6.11,;8.87,-3.8,;10.2,-2.99,;7.54,-3.03,)|
Show InChI InChI=1S/C17H23Cl2N/c1-20(2)10-14-11-3-5-12(6-4-11)17(14)13-7-8-15(18)16(19)9-13/h7-9,11-12,14,17H,3-6,10H2,1-2H3/t11?,12?,14-,17-/m0/s1
n/an/a 13n/an/an/an/an/an/a
TBA
Curated by ChEMBL
Assay Description
Effect on synaptosomal uptake inhibition of 5-hydroxytryptamine (5-HT)
J Med Chem 26: 935-47 (1983)
BindingDB Entry DOI: 10.7270/Q2JH3MR6
Dopamine receptor
(Rattus norvegicus (rat)-RAT-Rattus norvegicus (Rat...)
BDBM50026948
((trans) [3-(3,4-Dichloro-phenyl)-bicyclo[2.2.2]oct...)
Show SMILES CN(C)C[C@H]1C2CCC(CC2)[C@H]1c1ccc(Cl)c(Cl)c1 |wD:11.13,4.3,(7.55,1.59,;6.22,.82,;4.89,1.59,;6.22,-.68,;4.89,-1.49,;3.54,-.72,;2.22,-1.49,;2.22,-3.03,;3.54,-3.8,;4.09,-2.55,;2.77,-2.03,;4.89,-3.03,;6.2,-3.8,;6.2,-5.34,;7.55,-6.11,;8.89,-5.34,;10.21,-6.11,;8.87,-3.8,;10.2,-2.99,;7.54,-3.03,)|
Show InChI InChI=1S/C17H23Cl2N/c1-20(2)10-14-11-3-5-12(6-4-11)17(14)13-7-8-15(18)16(19)9-13/h7-9,11-12,14,17H,3-6,10H2,1-2H3/t11?,12?,14-,17-/m0/s1
Reactome pathway
n/an/a 11n/an/an/an/an/an/a
TBA
Curated by ChEMBL
Assay Description
Effect of compound on synaptosomal uptake inhibition of Dopamine (DA)
J Med Chem 26: 935-47 (1983)
BindingDB Entry DOI: 10.7270/Q2JH3MR6