BDBM50027178 CHEMBL2371712
SMILES: [#6]-[#6]-[#6]-[#6]-[#6@H](-[#7]-[#6](=O)-[#6@@H](-[#7]-[#6](=O)-[#6@@H](-[#7])-[#6]-c1ccc(-[#8])cc1)-[#6](-[#6])-[#6])-[#6](=O)-[#7]-[#6]-[#6](=O)-[#7]-1-[#6]-[#6]-[#6]-[#6@H]-1-[#6](=O)-[#7]-[#6@H](-[#6]-c1ccc2ccccc2c1)-[#6](=O)-[#7]-[#6@@H](-[#6]-[#6]-[#6]\[#7]=[#6](/[#7])-[#7])-[#6](=O)-[#7]-[#6@H](-[#6]-c1ccc2ccccc2c1)-[#6](=O)-[#7]-[#6@@H](-[#6]-[#6](-[#8])=O)-[#6](=O)-[#7]-[#6@@H](-[#6]-[#6]-[#6]\[#7]=[#6](/[#7])-[#7])-[#6](=O)-[#7]-[#6@@H](-[#6]-c1ccccc1)-[#6](=O)-[#7]-[#6]-[#6](=O)-[#8]-[#7]
InChI Key: InChIKey=UKMQKNTZNHDSPD-BJHTYDBZSA-N
Data: 4 IC50  3 EC50
Activity Spreadsheet -- Enzyme Inhibition Constant Data from BindingDB
Found 7 hits for monomerid = 50027178
Trg + Lig
Ki
nM
ΔG°
kcal/mole
IC50
nM
Kd
nM
EC50/IC50
nM
koff
s-1
kon
M-1s-1
pHTemp
°C
Melanocyte-stimulating hormone receptor
(Homo sapiens (Human))
BDBM50027178
(CHEMBL2371712)
Show SMILES [#6]-[#6]-[#6]-[#6]-[#6@H](-[#7]-[#6](=O)-[#6@@H](-[#7]-[#6](=O)-[#6@@H](-[#7])-[#6]-c1ccc(-[#8])cc1)-[#6](-[#6])-[#6])-[#6](=O)-[#7]-[#6]-[#6](=O)-[#7]-1-[#6]-[#6]-[#6]-[#6@H]-1-[#6](=O)-[#7]-[#6@H](-[#6]-c1ccc2ccccc2c1)-[#6](=O)-[#7]-[#6@@H](-[#6]-[#6]-[#6]\[#7]=[#6](/[#7])-[#7])-[#6](=O)-[#7]-[#6@H](-[#6]-c1ccc2ccccc2c1)-[#6](=O)-[#7]-[#6@@H](-[#6]-[#6](-[#8])=O)-[#6](=O)-[#7]-[#6@@H](-[#6]-[#6]-[#6]\[#7]=[#6](/[#7])-[#7])-[#6](=O)-[#7]-[#6@@H](-[#6]-c1ccccc1)-[#6](=O)-[#7]-[#6]-[#6](=O)-[#8]-[#7]
Show InChI InChI=1S/C80H105N19O16/c1-4-5-22-57(93-78(114)68(46(2)3)98-69(105)56(81)39-48-28-32-55(100)33-29-48)70(106)89-44-65(101)99-36-15-25-64(99)77(113)97-62(42-50-27-31-52-19-10-12-21-54(52)38-50)74(110)91-59(24-14-35-88-80(84)85)73(109)95-61(41-49-26-30-51-18-9-11-20-53(51)37-49)75(111)96-63(43-66(102)103)76(112)92-58(23-13-34-87-79(82)83)72(108)94-60(40-47-16-7-6-8-17-47)71(107)90-45-67(104)115-86/h6-12,16-21,26-33,37-38,46,56-64,68,100H,4-5,13-15,22-25,34-36,39-45,81,86H2,1-3H3,(H,89,106)(H,90,107)(H,91,110)(H,92,112)(H,93,114)(H,94,108)(H,95,109)(H,96,111)(H,97,113)(H,98,105)(H,102,103)(H4,82,83,87)(H4,84,85,88)/t56-,57-,58-,59-,60-,61+,62+,63-,64-,68-/m0/s1
n/an/an/an/a 2n/an/an/an/a
University of Arizona
Curated by ChEMBL
Assay Description
Effective concentration for intracellular cAMP accumulation in human melanocortin 1 receptor expressing HEK 293 cells; (N = 4)
J Med Chem 48: 1839-48 (2005)
Article DOI: 10.1021/jm049579s
BindingDB Entry DOI: 10.7270/Q2XD12F5
Melanocortin receptor 3
(Homo sapiens (Human))
BDBM50027178
(CHEMBL2371712)
Show SMILES [#6]-[#6]-[#6]-[#6]-[#6@H](-[#7]-[#6](=O)-[#6@@H](-[#7]-[#6](=O)-[#6@@H](-[#7])-[#6]-c1ccc(-[#8])cc1)-[#6](-[#6])-[#6])-[#6](=O)-[#7]-[#6]-[#6](=O)-[#7]-1-[#6]-[#6]-[#6]-[#6@H]-1-[#6](=O)-[#7]-[#6@H](-[#6]-c1ccc2ccccc2c1)-[#6](=O)-[#7]-[#6@@H](-[#6]-[#6]-[#6]\[#7]=[#6](/[#7])-[#7])-[#6](=O)-[#7]-[#6@H](-[#6]-c1ccc2ccccc2c1)-[#6](=O)-[#7]-[#6@@H](-[#6]-[#6](-[#8])=O)-[#6](=O)-[#7]-[#6@@H](-[#6]-[#6]-[#6]\[#7]=[#6](/[#7])-[#7])-[#6](=O)-[#7]-[#6@@H](-[#6]-c1ccccc1)-[#6](=O)-[#7]-[#6]-[#6](=O)-[#8]-[#7]
Show InChI InChI=1S/C80H105N19O16/c1-4-5-22-57(93-78(114)68(46(2)3)98-69(105)56(81)39-48-28-32-55(100)33-29-48)70(106)89-44-65(101)99-36-15-25-64(99)77(113)97-62(42-50-27-31-52-19-10-12-21-54(52)38-50)74(110)91-59(24-14-35-88-80(84)85)73(109)95-61(41-49-26-30-51-18-9-11-20-53(51)37-49)75(111)96-63(43-66(102)103)76(112)92-58(23-13-34-87-79(82)83)72(108)94-60(40-47-16-7-6-8-17-47)71(107)90-45-67(104)115-86/h6-12,16-21,26-33,37-38,46,56-64,68,100H,4-5,13-15,22-25,34-36,39-45,81,86H2,1-3H3,(H,89,106)(H,90,107)(H,91,110)(H,92,112)(H,93,114)(H,94,108)(H,95,109)(H,96,111)(H,97,113)(H,98,105)(H,102,103)(H4,82,83,87)(H4,84,85,88)/t56-,57-,58-,59-,60-,61+,62+,63-,64-,68-/m0/s1
n/an/a 3n/an/an/an/an/an/a
University of Arizona
Curated by ChEMBL
Assay Description
Inhibition of [125I]NDP-MSH binding to Melanocortin 3 receptor expressed in HEK293 cells; (N = 4)
J Med Chem 48: 1839-48 (2005)
Article DOI: 10.1021/jm049579s
BindingDB Entry DOI: 10.7270/Q2XD12F5
Melanocortin receptor 4
(Homo sapiens (Human))
BDBM50027178
(CHEMBL2371712)
Show SMILES [#6]-[#6]-[#6]-[#6]-[#6@H](-[#7]-[#6](=O)-[#6@@H](-[#7]-[#6](=O)-[#6@@H](-[#7])-[#6]-c1ccc(-[#8])cc1)-[#6](-[#6])-[#6])-[#6](=O)-[#7]-[#6]-[#6](=O)-[#7]-1-[#6]-[#6]-[#6]-[#6@H]-1-[#6](=O)-[#7]-[#6@H](-[#6]-c1ccc2ccccc2c1)-[#6](=O)-[#7]-[#6@@H](-[#6]-[#6]-[#6]\[#7]=[#6](/[#7])-[#7])-[#6](=O)-[#7]-[#6@H](-[#6]-c1ccc2ccccc2c1)-[#6](=O)-[#7]-[#6@@H](-[#6]-[#6](-[#8])=O)-[#6](=O)-[#7]-[#6@@H](-[#6]-[#6]-[#6]\[#7]=[#6](/[#7])-[#7])-[#6](=O)-[#7]-[#6@@H](-[#6]-c1ccccc1)-[#6](=O)-[#7]-[#6]-[#6](=O)-[#8]-[#7]
Show InChI InChI=1S/C80H105N19O16/c1-4-5-22-57(93-78(114)68(46(2)3)98-69(105)56(81)39-48-28-32-55(100)33-29-48)70(106)89-44-65(101)99-36-15-25-64(99)77(113)97-62(42-50-27-31-52-19-10-12-21-54(52)38-50)74(110)91-59(24-14-35-88-80(84)85)73(109)95-61(41-49-26-30-51-18-9-11-20-53(51)37-49)75(111)96-63(43-66(102)103)76(112)92-58(23-13-34-87-79(82)83)72(108)94-60(40-47-16-7-6-8-17-47)71(107)90-45-67(104)115-86/h6-12,16-21,26-33,37-38,46,56-64,68,100H,4-5,13-15,22-25,34-36,39-45,81,86H2,1-3H3,(H,89,106)(H,90,107)(H,91,110)(H,92,112)(H,93,114)(H,94,108)(H,95,109)(H,96,111)(H,97,113)(H,98,105)(H,102,103)(H4,82,83,87)(H4,84,85,88)/t56-,57-,58-,59-,60-,61+,62+,63-,64-,68-/m0/s1
n/an/a 4n/an/an/an/an/an/a
University of Arizona
Curated by ChEMBL
Assay Description
Inhibition of [125I]NDP-MSH binding to Melanocortin 4 receptor expressed in HEK293 cells; (N = 4)
J Med Chem 48: 1839-48 (2005)
Article DOI: 10.1021/jm049579s
BindingDB Entry DOI: 10.7270/Q2XD12F5
Melanocortin receptor 4
(Homo sapiens (Human))
BDBM50027178
(CHEMBL2371712)
Show SMILES [#6]-[#6]-[#6]-[#6]-[#6@H](-[#7]-[#6](=O)-[#6@@H](-[#7]-[#6](=O)-[#6@@H](-[#7])-[#6]-c1ccc(-[#8])cc1)-[#6](-[#6])-[#6])-[#6](=O)-[#7]-[#6]-[#6](=O)-[#7]-1-[#6]-[#6]-[#6]-[#6@H]-1-[#6](=O)-[#7]-[#6@H](-[#6]-c1ccc2ccccc2c1)-[#6](=O)-[#7]-[#6@@H](-[#6]-[#6]-[#6]\[#7]=[#6](/[#7])-[#7])-[#6](=O)-[#7]-[#6@H](-[#6]-c1ccc2ccccc2c1)-[#6](=O)-[#7]-[#6@@H](-[#6]-[#6](-[#8])=O)-[#6](=O)-[#7]-[#6@@H](-[#6]-[#6]-[#6]\[#7]=[#6](/[#7])-[#7])-[#6](=O)-[#7]-[#6@@H](-[#6]-c1ccccc1)-[#6](=O)-[#7]-[#6]-[#6](=O)-[#8]-[#7]
Show InChI InChI=1S/C80H105N19O16/c1-4-5-22-57(93-78(114)68(46(2)3)98-69(105)56(81)39-48-28-32-55(100)33-29-48)70(106)89-44-65(101)99-36-15-25-64(99)77(113)97-62(42-50-27-31-52-19-10-12-21-54(52)38-50)74(110)91-59(24-14-35-88-80(84)85)73(109)95-61(41-49-26-30-51-18-9-11-20-53(51)37-49)75(111)96-63(43-66(102)103)76(112)92-58(23-13-34-87-79(82)83)72(108)94-60(40-47-16-7-6-8-17-47)71(107)90-45-67(104)115-86/h6-12,16-21,26-33,37-38,46,56-64,68,100H,4-5,13-15,22-25,34-36,39-45,81,86H2,1-3H3,(H,89,106)(H,90,107)(H,91,110)(H,92,112)(H,93,114)(H,94,108)(H,95,109)(H,96,111)(H,97,113)(H,98,105)(H,102,103)(H4,82,83,87)(H4,84,85,88)/t56-,57-,58-,59-,60-,61+,62+,63-,64-,68-/m0/s1
n/an/an/an/a 3.30n/an/an/an/a
University of Arizona
Curated by ChEMBL
Assay Description
Effective concentration for intracellular cAMP accumulation in human melanocortin 4 receptor expressing HEK 293 cells; (N = 4)
J Med Chem 48: 1839-48 (2005)
Article DOI: 10.1021/jm049579s
BindingDB Entry DOI: 10.7270/Q2XD12F5
Melanocyte-stimulating hormone receptor
(Homo sapiens (Human))
BDBM50027178
(CHEMBL2371712)
Show SMILES [#6]-[#6]-[#6]-[#6]-[#6@H](-[#7]-[#6](=O)-[#6@@H](-[#7]-[#6](=O)-[#6@@H](-[#7])-[#6]-c1ccc(-[#8])cc1)-[#6](-[#6])-[#6])-[#6](=O)-[#7]-[#6]-[#6](=O)-[#7]-1-[#6]-[#6]-[#6]-[#6@H]-1-[#6](=O)-[#7]-[#6@H](-[#6]-c1ccc2ccccc2c1)-[#6](=O)-[#7]-[#6@@H](-[#6]-[#6]-[#6]\[#7]=[#6](/[#7])-[#7])-[#6](=O)-[#7]-[#6@H](-[#6]-c1ccc2ccccc2c1)-[#6](=O)-[#7]-[#6@@H](-[#6]-[#6](-[#8])=O)-[#6](=O)-[#7]-[#6@@H](-[#6]-[#6]-[#6]\[#7]=[#6](/[#7])-[#7])-[#6](=O)-[#7]-[#6@@H](-[#6]-c1ccccc1)-[#6](=O)-[#7]-[#6]-[#6](=O)-[#8]-[#7]
Show InChI InChI=1S/C80H105N19O16/c1-4-5-22-57(93-78(114)68(46(2)3)98-69(105)56(81)39-48-28-32-55(100)33-29-48)70(106)89-44-65(101)99-36-15-25-64(99)77(113)97-62(42-50-27-31-52-19-10-12-21-54(52)38-50)74(110)91-59(24-14-35-88-80(84)85)73(109)95-61(41-49-26-30-51-18-9-11-20-53(51)37-49)75(111)96-63(43-66(102)103)76(112)92-58(23-13-34-87-79(82)83)72(108)94-60(40-47-16-7-6-8-17-47)71(107)90-45-67(104)115-86/h6-12,16-21,26-33,37-38,46,56-64,68,100H,4-5,13-15,22-25,34-36,39-45,81,86H2,1-3H3,(H,89,106)(H,90,107)(H,91,110)(H,92,112)(H,93,114)(H,94,108)(H,95,109)(H,96,111)(H,97,113)(H,98,105)(H,102,103)(H4,82,83,87)(H4,84,85,88)/t56-,57-,58-,59-,60-,61+,62+,63-,64-,68-/m0/s1
n/an/a 2n/an/an/an/an/an/a
University of Arizona
Curated by ChEMBL
Assay Description
Inhibition of [125I]NDP-MSH binding to Melanocortin 1 receptor expressed in HEK293 cells; (N = 4)
J Med Chem 48: 1839-48 (2005)
Article DOI: 10.1021/jm049579s
BindingDB Entry DOI: 10.7270/Q2XD12F5
Melanocortin receptor 5 (MC5R)
(Homo sapiens (Human))
BDBM50027178
(CHEMBL2371712)
Show SMILES [#6]-[#6]-[#6]-[#6]-[#6@H](-[#7]-[#6](=O)-[#6@@H](-[#7]-[#6](=O)-[#6@@H](-[#7])-[#6]-c1ccc(-[#8])cc1)-[#6](-[#6])-[#6])-[#6](=O)-[#7]-[#6]-[#6](=O)-[#7]-1-[#6]-[#6]-[#6]-[#6@H]-1-[#6](=O)-[#7]-[#6@H](-[#6]-c1ccc2ccccc2c1)-[#6](=O)-[#7]-[#6@@H](-[#6]-[#6]-[#6]\[#7]=[#6](/[#7])-[#7])-[#6](=O)-[#7]-[#6@H](-[#6]-c1ccc2ccccc2c1)-[#6](=O)-[#7]-[#6@@H](-[#6]-[#6](-[#8])=O)-[#6](=O)-[#7]-[#6@@H](-[#6]-[#6]-[#6]\[#7]=[#6](/[#7])-[#7])-[#6](=O)-[#7]-[#6@@H](-[#6]-c1ccccc1)-[#6](=O)-[#7]-[#6]-[#6](=O)-[#8]-[#7]
Show InChI InChI=1S/C80H105N19O16/c1-4-5-22-57(93-78(114)68(46(2)3)98-69(105)56(81)39-48-28-32-55(100)33-29-48)70(106)89-44-65(101)99-36-15-25-64(99)77(113)97-62(42-50-27-31-52-19-10-12-21-54(52)38-50)74(110)91-59(24-14-35-88-80(84)85)73(109)95-61(41-49-26-30-51-18-9-11-20-53(51)37-49)75(111)96-63(43-66(102)103)76(112)92-58(23-13-34-87-79(82)83)72(108)94-60(40-47-16-7-6-8-17-47)71(107)90-45-67(104)115-86/h6-12,16-21,26-33,37-38,46,56-64,68,100H,4-5,13-15,22-25,34-36,39-45,81,86H2,1-3H3,(H,89,106)(H,90,107)(H,91,110)(H,92,112)(H,93,114)(H,94,108)(H,95,109)(H,96,111)(H,97,113)(H,98,105)(H,102,103)(H4,82,83,87)(H4,84,85,88)/t56-,57-,58-,59-,60-,61+,62+,63-,64-,68-/m0/s1
n/an/a 2n/an/an/an/an/an/a
University of Arizona
Curated by ChEMBL
Assay Description
Inhibition of [125I]NDP-MSH binding to Melanocortin 5 receptor expressed in HEK293 cells; N = 4
J Med Chem 48: 1839-48 (2005)
Article DOI: 10.1021/jm049579s
BindingDB Entry DOI: 10.7270/Q2XD12F5
Melanocortin receptor 3
(Homo sapiens (Human))
BDBM50027178
(CHEMBL2371712)
Show SMILES [#6]-[#6]-[#6]-[#6]-[#6@H](-[#7]-[#6](=O)-[#6@@H](-[#7]-[#6](=O)-[#6@@H](-[#7])-[#6]-c1ccc(-[#8])cc1)-[#6](-[#6])-[#6])-[#6](=O)-[#7]-[#6]-[#6](=O)-[#7]-1-[#6]-[#6]-[#6]-[#6@H]-1-[#6](=O)-[#7]-[#6@H](-[#6]-c1ccc2ccccc2c1)-[#6](=O)-[#7]-[#6@@H](-[#6]-[#6]-[#6]\[#7]=[#6](/[#7])-[#7])-[#6](=O)-[#7]-[#6@H](-[#6]-c1ccc2ccccc2c1)-[#6](=O)-[#7]-[#6@@H](-[#6]-[#6](-[#8])=O)-[#6](=O)-[#7]-[#6@@H](-[#6]-[#6]-[#6]\[#7]=[#6](/[#7])-[#7])-[#6](=O)-[#7]-[#6@@H](-[#6]-c1ccccc1)-[#6](=O)-[#7]-[#6]-[#6](=O)-[#8]-[#7]
Show InChI InChI=1S/C80H105N19O16/c1-4-5-22-57(93-78(114)68(46(2)3)98-69(105)56(81)39-48-28-32-55(100)33-29-48)70(106)89-44-65(101)99-36-15-25-64(99)77(113)97-62(42-50-27-31-52-19-10-12-21-54(52)38-50)74(110)91-59(24-14-35-88-80(84)85)73(109)95-61(41-49-26-30-51-18-9-11-20-53(51)37-49)75(111)96-63(43-66(102)103)76(112)92-58(23-13-34-87-79(82)83)72(108)94-60(40-47-16-7-6-8-17-47)71(107)90-45-67(104)115-86/h6-12,16-21,26-33,37-38,46,56-64,68,100H,4-5,13-15,22-25,34-36,39-45,81,86H2,1-3H3,(H,89,106)(H,90,107)(H,91,110)(H,92,112)(H,93,114)(H,94,108)(H,95,109)(H,96,111)(H,97,113)(H,98,105)(H,102,103)(H4,82,83,87)(H4,84,85,88)/t56-,57-,58-,59-,60-,61+,62+,63-,64-,68-/m0/s1
n/an/an/an/a 11n/an/an/an/a
University of Arizona
Curated by ChEMBL
Assay Description
Effective concentration for intracellular cAMP accumulation in human melanocortin 3 receptor expressing HEK 293 cells; (N = 4)
J Med Chem 48: 1839-48 (2005)
Article DOI: 10.1021/jm049579s
BindingDB Entry DOI: 10.7270/Q2XD12F5