null
SMILES: CN1CCC(CC1)C(=O)N1Cc2c(NC(=O)NCc3ccccc3)n[nH]c2C1(C)C
InChI Key: InChIKey=ZCUPTZASSFWMPJ-UHFFFAOYSA-N
Activity Spreadsheet -- Enzyme Inhibition Constant Data from BindingDB
Found 1 hit for monomerid = 50027398
Trg + Lig
Ki
nM
ΔG°
kcal/mole
IC50
nM
Kd
nM
EC50/IC50
nM
koff
s-1
kon
M-1s-1
pHTemp
°C
Cyclin-A1/Cyclin-A2/Cyclin-dependent kinase 2
(Homo sapiens (Human))
BDBM50027398
(CHEMBL597992)
Show SMILES CN1CCC(CC1)C(=O)N1Cc2c(NC(=O)NCc3ccccc3)n[nH]c2C1(C)C
Show InChI InChI=1S/C22H30N6O2/c1-22(2)18-17(14-28(22)20(29)16-9-11-27(3)12-10-16)19(26-25-18)24-21(30)23-13-15-7-5-4-6-8-15/h4-8,16H,9-14H2,1-3H3,(H3,23,24,25,26,30)
Reactome pathway
n/an/a 21n/an/an/an/an/an/a
Nerviano Medical Sciences Srl
Curated by ChEMBL
Assay Description
Inhibition of human CDK2/cyclin A expressed in Escherichia coli BL21 by scintillation proximity assay
Bioorg Med Chem 18: 1844-53 (2010)
Article DOI: 10.1016/j.bmc.2010.01.042
BindingDB Entry DOI: 10.7270/Q21R6RG5