BDBM50027524 5-Oxo-icosa-6,8,11,14-tetraenoic acid methyl ester::CHEMBL165682
SMILES: CCCCC\C=C/C\C=C/CC=CC=CC(=O)CCCC(=O)OC
InChI Key: InChIKey=MOPVYNAAXAJXEV-OMMQXKPTSA-N
Data: 1 IC50  1 EC50
Activity Spreadsheet -- Enzyme Inhibition Constant Data from BindingDB
Found 2 hits for monomerid = 50027524
Trg + Lig
Ki
nM
ΔG°
kcal/mole
IC50
nM
Kd
nM
EC50/IC50
nM
koff
s-1
kon
M-1s-1
pHTemp
°C
TG 1019
(Homo sapiens (Human))
BDBM50027524
(5-Oxo-icosa-6,8,11,14-tetraenoic acid methyl ester...)
Show SMILES CCCCC\C=C/C\C=C/CC=CC=CC(=O)CCCC(=O)OC |w:13.12,11.10|
Show InChI InChI=1S/C21H32O3/c1-3-4-5-6-7-8-9-10-11-12-13-14-15-17-20(22)18-16-19-21(23)24-2/h7-8,10-11,13-15,17H,3-6,9,12,16,18-19H2,1-2H3/b8-7-,11-10-,14-13?,17-15?
n/an/an/an/a 1.54E+3n/an/an/an/a
Hospital del Mar Medical Research Institute (IMIM)
Curated by ChEMBL
Assay Description
Agonist activity at human PK-tagged OXER1 expressed in CHOK1 cells assessed as EA-tagged beta-arrestin recruitment by beta-galactosidase enzyme fragm...
Bioorg Med Chem 26: 3580-3587 (2018)
Article DOI: 10.1016/j.bmc.2018.05.036
BindingDB Entry DOI: 10.7270/Q2X63QFQ
Arachidonate 5-lipoxygenase
(Homo sapiens (Human))
BDBM50027524
(5-Oxo-icosa-6,8,11,14-tetraenoic acid methyl ester...)
Show SMILES CCCCC\C=C/C\C=C/CC=CC=CC(=O)CCCC(=O)OC |w:13.12,11.10|
Show InChI InChI=1S/C21H32O3/c1-3-4-5-6-7-8-9-10-11-12-13-14-15-17-20(22)18-16-19-21(23)24-2/h7-8,10-11,13-15,17H,3-6,9,12,16,18-19H2,1-2H3/b8-7-,11-10-,14-13?,17-15?
Reactome pathway
n/an/a 2.00E+4n/an/an/an/an/an/a
TBA
Curated by ChEMBL
Assay Description
Inhibitory activity against 5-lipoxygenase
J Med Chem 26: 72-8 (1983)
BindingDB Entry DOI: 10.7270/Q2WD3ZJQ