null
SMILES: FC(F)(F)c1ccc(CNC(=O)[C@H](CCCCCS)NC(=O)[C@@H]2CCCC(=O)N2)cc1
InChI Key: InChIKey=QVHKENDYYOPWET-IRXDYDNUSA-N
Activity Spreadsheet -- Enzyme Inhibition Constant Data from BindingDB
Found 7 hits for monomerid = 50027593
Trg + Lig
Ki
nM
ΔG°
kcal/mole
IC50
nM
Kd
nM
EC50/IC50
nM
koff
s-1
kon
M-1s-1
pHTemp
°C
Histone deacetylase 3
(Homo sapiens (Human))
BDBM50027593
(CHEMBL3356933)
Show SMILES FC(F)(F)c1ccc(CNC(=O)[C@H](CCCCCS)NC(=O)[C@@H]2CCCC(=O)N2)cc1 |r|
Show InChI InChI=1S/C21H28F3N3O3S/c22-21(23,24)15-10-8-14(9-11-15)13-25-19(29)16(5-2-1-3-12-31)27-20(30)17-6-4-7-18(28)26-17/h8-11,16-17,31H,1-7,12-13H2,(H,25,29)(H,26,28)(H,27,30)/t16-,17-/m0/s1
NCI pathway
Reactome pathway
n/an/a 475n/an/an/an/an/an/a
R&D Sigma-Tau Industrie Farmaceutiche Riunite SpA
Curated by ChEMBL
Assay Description
Inhibition of HDAC3 (unknown origin) using fluorogenic tetrapeptide RHKK(Ac) substrate by fluorescence assay
J Med Chem 57: 8358-77 (2014)
Article DOI: 10.1021/jm5008209
BindingDB Entry DOI: 10.7270/Q2JW8GGN
Histone deacetylase 6
(Homo sapiens (Human))
BDBM50027593
(CHEMBL3356933)
Show SMILES FC(F)(F)c1ccc(CNC(=O)[C@H](CCCCCS)NC(=O)[C@@H]2CCCC(=O)N2)cc1 |r|
Show InChI InChI=1S/C21H28F3N3O3S/c22-21(23,24)15-10-8-14(9-11-15)13-25-19(29)16(5-2-1-3-12-31)27-20(30)17-6-4-7-18(28)26-17/h8-11,16-17,31H,1-7,12-13H2,(H,25,29)(H,26,28)(H,27,30)/t16-,17-/m0/s1
NCI pathway
Reactome pathway
n/an/a 139n/an/an/an/an/an/a
R&D Sigma-Tau Industrie Farmaceutiche Riunite SpA
Curated by ChEMBL
Assay Description
Inhibition of HDAC6 (unknown origin) using fluorogenic tetrapeptide RHKK(Ac) substrate by fluorescence assay
J Med Chem 57: 8358-77 (2014)
Article DOI: 10.1021/jm5008209
BindingDB Entry DOI: 10.7270/Q2JW8GGN
Histone deacetylase 8
(Homo sapiens (Human))
BDBM50027593
(CHEMBL3356933)
Show SMILES FC(F)(F)c1ccc(CNC(=O)[C@H](CCCCCS)NC(=O)[C@@H]2CCCC(=O)N2)cc1 |r|
Show InChI InChI=1S/C21H28F3N3O3S/c22-21(23,24)15-10-8-14(9-11-15)13-25-19(29)16(5-2-1-3-12-31)27-20(30)17-6-4-7-18(28)26-17/h8-11,16-17,31H,1-7,12-13H2,(H,25,29)(H,26,28)(H,27,30)/t16-,17-/m0/s1
NCI pathway
Reactome pathway
n/an/a 23n/an/an/an/an/an/a
R&D Sigma-Tau Industrie Farmaceutiche Riunite SpA
Curated by ChEMBL
Assay Description
Inhibition of HDAC8 (unknown origin) using fluorogenic tetrapeptide RHK(Ac)K(Ac) substrate by fluorescence assay
J Med Chem 57: 8358-77 (2014)
Article DOI: 10.1021/jm5008209
BindingDB Entry DOI: 10.7270/Q2JW8GGN
Histone deacetylase 11
(Homo sapiens (Human))
BDBM50027593
(CHEMBL3356933)
Show SMILES FC(F)(F)c1ccc(CNC(=O)[C@H](CCCCCS)NC(=O)[C@@H]2CCCC(=O)N2)cc1 |r|
Show InChI InChI=1S/C21H28F3N3O3S/c22-21(23,24)15-10-8-14(9-11-15)13-25-19(29)16(5-2-1-3-12-31)27-20(30)17-6-4-7-18(28)26-17/h8-11,16-17,31H,1-7,12-13H2,(H,25,29)(H,26,28)(H,27,30)/t16-,17-/m0/s1
NCI pathway
Reactome pathway
n/an/a 140n/an/an/an/an/an/a
R&D Sigma-Tau Industrie Farmaceutiche Riunite SpA
Curated by ChEMBL
Assay Description
Inhibition of HDAC11 (unknown origin) using fluorogenic tetrapeptide RHKK(Ac) substrate by fluorescence assay
J Med Chem 57: 8358-77 (2014)
Article DOI: 10.1021/jm5008209
BindingDB Entry DOI: 10.7270/Q2JW8GGN
Histone deacetylase 2
(Homo sapiens (Human))
BDBM50027593
(CHEMBL3356933)
Show SMILES FC(F)(F)c1ccc(CNC(=O)[C@H](CCCCCS)NC(=O)[C@@H]2CCCC(=O)N2)cc1 |r|
Show InChI InChI=1S/C21H28F3N3O3S/c22-21(23,24)15-10-8-14(9-11-15)13-25-19(29)16(5-2-1-3-12-31)27-20(30)17-6-4-7-18(28)26-17/h8-11,16-17,31H,1-7,12-13H2,(H,25,29)(H,26,28)(H,27,30)/t16-,17-/m0/s1
NCI pathway
Reactome pathway
n/an/a 1.77E+3n/an/an/an/an/an/a
R&D Sigma-Tau Industrie Farmaceutiche Riunite SpA
Curated by ChEMBL
Assay Description
Inhibition of HDAC2 (unknown origin) using fluorogenic tetrapeptide RHKK(Ac) substrate by fluorescence assay
J Med Chem 57: 8358-77 (2014)
Article DOI: 10.1021/jm5008209
BindingDB Entry DOI: 10.7270/Q2JW8GGN
Polyamine deacetylase HDAC10
(Homo sapiens (Human))
BDBM50027593
(CHEMBL3356933)
Show SMILES FC(F)(F)c1ccc(CNC(=O)[C@H](CCCCCS)NC(=O)[C@@H]2CCCC(=O)N2)cc1 |r|
Show InChI InChI=1S/C21H28F3N3O3S/c22-21(23,24)15-10-8-14(9-11-15)13-25-19(29)16(5-2-1-3-12-31)27-20(30)17-6-4-7-18(28)26-17/h8-11,16-17,31H,1-7,12-13H2,(H,25,29)(H,26,28)(H,27,30)/t16-,17-/m0/s1
NCI pathway
Reactome pathway
n/an/a 310n/an/an/an/an/an/a
R&D Sigma-Tau Industrie Farmaceutiche Riunite SpA
Curated by ChEMBL
Assay Description
Inhibition of HDAC10 (unknown origin) using fluorogenic tetrapeptide RHKK(Ac) substrate by fluorescence assay
J Med Chem 57: 8358-77 (2014)
Article DOI: 10.1021/jm5008209
BindingDB Entry DOI: 10.7270/Q2JW8GGN
Histone deacetylase 1
(Homo sapiens (Human))
BDBM50027593
(CHEMBL3356933)
Show SMILES FC(F)(F)c1ccc(CNC(=O)[C@H](CCCCCS)NC(=O)[C@@H]2CCCC(=O)N2)cc1 |r|
Show InChI InChI=1S/C21H28F3N3O3S/c22-21(23,24)15-10-8-14(9-11-15)13-25-19(29)16(5-2-1-3-12-31)27-20(30)17-6-4-7-18(28)26-17/h8-11,16-17,31H,1-7,12-13H2,(H,25,29)(H,26,28)(H,27,30)/t16-,17-/m0/s1
NCI pathway
Reactome pathway
n/an/a 386n/an/an/an/an/an/a
R&D Sigma-Tau Industrie Farmaceutiche Riunite SpA
Curated by ChEMBL
Assay Description
Inhibition of HDAC1 (unknown origin) using fluorogenic tetrapeptide RHKK(Ac) substrate by fluorescence assay
J Med Chem 57: 8358-77 (2014)
Article DOI: 10.1021/jm5008209
BindingDB Entry DOI: 10.7270/Q2JW8GGN