BDBM50027650 CHEMBL3356915
SMILES: SCCCCC[C@H](NC(=O)[C@H]1CCCNC1=O)C(=O)Nc1ccccc1
InChI Key: InChIKey=ILCBWDQDWOLKIQ-HOTGVXAUSA-N
Data: 7 IC50
Activity Spreadsheet -- Enzyme Inhibition Constant Data from BindingDB
Found 7 hits for monomerid = 50027650
Trg + Lig
Ki
nM
ΔG°
kcal/mole
IC50
nM
Kd
nM
EC50/IC50
nM
koff
s-1
kon
M-1s-1
pHTemp
°C
Cereblon/Histone deacetylase 6
(Homo sapiens (Human))
BDBM50027650
(CHEMBL3356915)
Show SMILES SCCCCC[C@H](NC(=O)[C@H]1CCCNC1=O)C(=O)Nc1ccccc1 |r|
Show InChI InChI=1S/C19H27N3O3S/c23-17-15(10-7-12-20-17)18(24)22-16(11-5-2-6-13-26)19(25)21-14-8-3-1-4-9-14/h1,3-4,8-9,15-16,26H,2,5-7,10-13H2,(H,20,23)(H,21,25)(H,22,24)/t15-,16-/m0/s1
NCI pathway
Reactome pathway
n/an/a 1n/an/an/an/an/an/a
R&D Sigma-Tau Industrie Farmaceutiche Riunite SpA
Curated by ChEMBL
Assay Description
Inhibition of HDAC6 (unknown origin) using fluorogenic tetrapeptide RHKK(Ac) substrate by fluorescence assay
J Med Chem 57: 8358-77 (2014)
Article DOI: 10.1021/jm5008209
BindingDB Entry DOI: 10.7270/Q2JW8GGN
Histone deacetylase 8
(Homo sapiens (Human))
BDBM50027650
(CHEMBL3356915)
Show SMILES SCCCCC[C@H](NC(=O)[C@H]1CCCNC1=O)C(=O)Nc1ccccc1 |r|
Show InChI InChI=1S/C19H27N3O3S/c23-17-15(10-7-12-20-17)18(24)22-16(11-5-2-6-13-26)19(25)21-14-8-3-1-4-9-14/h1,3-4,8-9,15-16,26H,2,5-7,10-13H2,(H,20,23)(H,21,25)(H,22,24)/t15-,16-/m0/s1
NCI pathway
Reactome pathway
n/an/a 122n/an/an/an/an/an/a
R&D Sigma-Tau Industrie Farmaceutiche Riunite SpA
Curated by ChEMBL
Assay Description
Inhibition of HDAC8 (unknown origin) using fluorogenic tetrapeptide RHK(Ac)K(Ac) substrate by fluorescence assay
J Med Chem 57: 8358-77 (2014)
Article DOI: 10.1021/jm5008209
BindingDB Entry DOI: 10.7270/Q2JW8GGN
Histone deacetylase 2
(Homo sapiens (Human))
BDBM50027650
(CHEMBL3356915)
Show SMILES SCCCCC[C@H](NC(=O)[C@H]1CCCNC1=O)C(=O)Nc1ccccc1 |r|
Show InChI InChI=1S/C19H27N3O3S/c23-17-15(10-7-12-20-17)18(24)22-16(11-5-2-6-13-26)19(25)21-14-8-3-1-4-9-14/h1,3-4,8-9,15-16,26H,2,5-7,10-13H2,(H,20,23)(H,21,25)(H,22,24)/t15-,16-/m0/s1
NCI pathway
Reactome pathway
n/an/a 48n/an/an/an/an/an/a
R&D Sigma-Tau Industrie Farmaceutiche Riunite SpA
Curated by ChEMBL
Assay Description
Inhibition of HDAC2 (unknown origin) using fluorogenic tetrapeptide RHKK(Ac) substrate by fluorescence assay
J Med Chem 57: 8358-77 (2014)
Article DOI: 10.1021/jm5008209
BindingDB Entry DOI: 10.7270/Q2JW8GGN
Histone deacetylase 11
(Homo sapiens (Human))
BDBM50027650
(CHEMBL3356915)
Show SMILES SCCCCC[C@H](NC(=O)[C@H]1CCCNC1=O)C(=O)Nc1ccccc1 |r|
Show InChI InChI=1S/C19H27N3O3S/c23-17-15(10-7-12-20-17)18(24)22-16(11-5-2-6-13-26)19(25)21-14-8-3-1-4-9-14/h1,3-4,8-9,15-16,26H,2,5-7,10-13H2,(H,20,23)(H,21,25)(H,22,24)/t15-,16-/m0/s1
NCI pathway
Reactome pathway
n/an/a 15n/an/an/an/an/an/a
R&D Sigma-Tau Industrie Farmaceutiche Riunite SpA
Curated by ChEMBL
Assay Description
Inhibition of HDAC11 (unknown origin) using fluorogenic tetrapeptide RHKK(Ac) substrate by fluorescence assay
J Med Chem 57: 8358-77 (2014)
Article DOI: 10.1021/jm5008209
BindingDB Entry DOI: 10.7270/Q2JW8GGN
Histone deacetylase 3
(Homo sapiens (Human))
BDBM50027650
(CHEMBL3356915)
Show SMILES SCCCCC[C@H](NC(=O)[C@H]1CCCNC1=O)C(=O)Nc1ccccc1 |r|
Show InChI InChI=1S/C19H27N3O3S/c23-17-15(10-7-12-20-17)18(24)22-16(11-5-2-6-13-26)19(25)21-14-8-3-1-4-9-14/h1,3-4,8-9,15-16,26H,2,5-7,10-13H2,(H,20,23)(H,21,25)(H,22,24)/t15-,16-/m0/s1
NCI pathway
Reactome pathway
n/an/a 5n/an/an/an/an/an/a
R&D Sigma-Tau Industrie Farmaceutiche Riunite SpA
Curated by ChEMBL
Assay Description
Inhibition of HDAC3 (unknown origin) using fluorogenic tetrapeptide RHKK(Ac) substrate by fluorescence assay
J Med Chem 57: 8358-77 (2014)
Article DOI: 10.1021/jm5008209
BindingDB Entry DOI: 10.7270/Q2JW8GGN
Histone deacetylase 10
(Homo sapiens (Human))
BDBM50027650
(CHEMBL3356915)
Show SMILES SCCCCC[C@H](NC(=O)[C@H]1CCCNC1=O)C(=O)Nc1ccccc1 |r|
Show InChI InChI=1S/C19H27N3O3S/c23-17-15(10-7-12-20-17)18(24)22-16(11-5-2-6-13-26)19(25)21-14-8-3-1-4-9-14/h1,3-4,8-9,15-16,26H,2,5-7,10-13H2,(H,20,23)(H,21,25)(H,22,24)/t15-,16-/m0/s1
NCI pathway
Reactome pathway
n/an/a 11n/an/an/an/an/an/a
R&D Sigma-Tau Industrie Farmaceutiche Riunite SpA
Curated by ChEMBL
Assay Description
Inhibition of HDAC10 (unknown origin) using fluorogenic tetrapeptide RHKK(Ac) substrate by fluorescence assay
J Med Chem 57: 8358-77 (2014)
Article DOI: 10.1021/jm5008209
BindingDB Entry DOI: 10.7270/Q2JW8GGN
Histone deacetylase 1
(Homo sapiens (Human))
BDBM50027650
(CHEMBL3356915)
Show SMILES SCCCCC[C@H](NC(=O)[C@H]1CCCNC1=O)C(=O)Nc1ccccc1 |r|
Show InChI InChI=1S/C19H27N3O3S/c23-17-15(10-7-12-20-17)18(24)22-16(11-5-2-6-13-26)19(25)21-14-8-3-1-4-9-14/h1,3-4,8-9,15-16,26H,2,5-7,10-13H2,(H,20,23)(H,21,25)(H,22,24)/t15-,16-/m0/s1
NCI pathway
Reactome pathway
n/an/a 12n/an/an/an/an/an/a
R&D Sigma-Tau Industrie Farmaceutiche Riunite SpA
Curated by ChEMBL
Assay Description
Inhibition of HDAC1 (unknown origin) using fluorogenic tetrapeptide RHKK(Ac) substrate by fluorescence assay
J Med Chem 57: 8358-77 (2014)
Article DOI: 10.1021/jm5008209
BindingDB Entry DOI: 10.7270/Q2JW8GGN