BDBM50027689 CHEMBL3344399
SMILES: COc1cc(OC)cc(\C=C\c2cccc3n(CCCNS(=O)(=O)c4ccc(C)cc4)ccc23)c1
InChI Key: InChIKey=DDJXPAZBFKVUFW-ZHACJKMWSA-N
Data: 1 KI  1 IC50
Activity Spreadsheet -- Enzyme Inhibition Constant Data from BindingDB
Found 2 hits for monomerid = 50027689
Trg + Lig
Ki
nM
ΔG°
kcal/mole
IC50
nM
Kd
nM
EC50/IC50
nM
koff
s-1
kon
M-1s-1
pHTemp
°C
Cytochrome P450 24A1
(Homo sapiens (Human))
BDBM50027689
(CHEMBL3344399)
Show SMILES COc1cc(OC)cc(\C=C\c2cccc3n(CCCNS(=O)(=O)c4ccc(C)cc4)ccc23)c1
Show InChI InChI=1S/C28H30N2O4S/c1-21-8-12-26(13-9-21)35(31,32)29-15-5-16-30-17-14-27-23(6-4-7-28(27)30)11-10-22-18-24(33-2)20-25(19-22)34-3/h4,6-14,17-20,29H,5,15-16H2,1-3H3/b11-10+
Reactome pathway
730n/an/an/an/an/an/an/an/a
Cardiff University
Curated by ChEMBL
Assay Description
Inhibition of N-terminally MBP-fused human CYP24A1 by cell-free assay
Eur J Med Chem 87: 39-51 (2014)
Article DOI: 10.1016/j.ejmech.2014.09.035
BindingDB Entry DOI: 10.7270/Q2SF2XR1
Cytochrome P450 24A1
(Homo sapiens (Human))
BDBM50027689
(CHEMBL3344399)
Show SMILES COc1cc(OC)cc(\C=C\c2cccc3n(CCCNS(=O)(=O)c4ccc(C)cc4)ccc23)c1
Show InChI InChI=1S/C28H30N2O4S/c1-21-8-12-26(13-9-21)35(31,32)29-15-5-16-30-17-14-27-23(6-4-7-28(27)30)11-10-22-18-24(33-2)20-25(19-22)34-3/h4,6-14,17-20,29H,5,15-16H2,1-3H3/b11-10+
Reactome pathway
n/an/a 1.04E+4n/an/an/an/an/an/a
Cardiff University
Curated by ChEMBL
Assay Description
Inhibition of N-terminally MBP-fused human CYP24A1 by cell-free assay
Eur J Med Chem 87: 39-51 (2014)
Article DOI: 10.1016/j.ejmech.2014.09.035
BindingDB Entry DOI: 10.7270/Q2SF2XR1