BDBM50027692 CHEMBL3344398
SMILES: Cc1ccc(cc1)S(=O)(=O)NCCCn1ccc2c(\C=C\c3ccccc3)cccc12
InChI Key: InChIKey=WYFUXEOFECMHIM-BUHFOSPRSA-N
Data: 1 KI  1 IC50
Activity Spreadsheet -- Enzyme Inhibition Constant Data from BindingDB
Found 2 hits for monomerid = 50027692
Trg + Lig
Ki
nM
ΔG°
kcal/mole
IC50
nM
Kd
nM
EC50/IC50
nM
koff
s-1
kon
M-1s-1
pHTemp
°C
Cytochrome P450 24A1
(Homo sapiens (Human))
BDBM50027692
(CHEMBL3344398)
Show SMILES Cc1ccc(cc1)S(=O)(=O)NCCCn1ccc2c(\C=C\c3ccccc3)cccc12
Show InChI InChI=1S/C26H26N2O2S/c1-21-11-15-24(16-12-21)31(29,30)27-18-6-19-28-20-17-25-23(9-5-10-26(25)28)14-13-22-7-3-2-4-8-22/h2-5,7-17,20,27H,6,18-19H2,1H3/b14-13+
Reactome pathway
340n/an/an/an/an/an/an/an/a
Cardiff University
Curated by ChEMBL
Assay Description
Inhibition of N-terminally MBP-fused human CYP24A1 by cell-free assay
Eur J Med Chem 87: 39-51 (2014)
Article DOI: 10.1016/j.ejmech.2014.09.035
BindingDB Entry DOI: 10.7270/Q2SF2XR1
Cytochrome P450 24A1
(Homo sapiens (Human))
BDBM50027692
(CHEMBL3344398)
Show SMILES Cc1ccc(cc1)S(=O)(=O)NCCCn1ccc2c(\C=C\c3ccccc3)cccc12
Show InChI InChI=1S/C26H26N2O2S/c1-21-11-15-24(16-12-21)31(29,30)27-18-6-19-28-20-17-25-23(9-5-10-26(25)28)14-13-22-7-3-2-4-8-22/h2-5,7-17,20,27H,6,18-19H2,1H3/b14-13+
Reactome pathway
n/an/a 4.80E+3n/an/an/an/an/an/a
Cardiff University
Curated by ChEMBL
Assay Description
Inhibition of N-terminally MBP-fused human CYP24A1 by cell-free assay
Eur J Med Chem 87: 39-51 (2014)
Article DOI: 10.1016/j.ejmech.2014.09.035
BindingDB Entry DOI: 10.7270/Q2SF2XR1